BDBM50129263 CHEMBL3629733
SMILES: COc1cn(nc(-c2ccnn2-c2ccccc2)c1=O)-c1ccc2N(C)C(=O)C3(CCC3)c2c1F
InChI Key: InChIKey=PXJULTZKFUMJOG-UHFFFAOYSA-N
Data: 1 IC50
Activity Spreadsheet -- Enzyme Inhibition Constant Data from BindingDB
Found 1 hit for monomerid = 50129263
Trg + Lig
Ki
nM
ΔG°
kcal/mole
IC50
nM
Kd
nM
EC50/IC50
nM
koff
s-1
kon
M-1s-1
pHTemp
°C
cAMP and cAMP-inhibited cGMP 3',5'-cyclic phosphodiesterase 10A
(Homo sapiens (Human))
BDBM50129263
(CHEMBL3629733)
Show SMILES COc1cn(nc(-c2ccnn2-c2ccccc2)c1=O)-c1ccc2N(C)C(=O)C3(CCC3)c2c1F
Show InChI InChI=1S/C26H22FN5O3/c1-30-17-9-10-18(22(27)21(17)26(25(30)34)12-6-13-26)31-15-20(35-2)24(33)23(29-31)19-11-14-28-32(19)16-7-4-3-5-8-16/h3-5,7-11,14-15H,6,12-13H2,1-2H3
Reactome pathway
n/an/a 0.130n/an/an/an/an/an/a
Takeda Pharmaceutical Company Limited
Curated by ChEMBL
Assay Description
Inhibition of human PDE10A2 expressed in COS-7 cells using [3H]cGMP as substrate assessed as substrate hydrolysis after 60 mins by scintillation prox...
Bioorg Med Chem 23: 7138-49 (2015)
BindingDB Entry DOI: 10.7270/Q2NG4SGN