BDBM50129264 CHEMBL3629732
SMILES: COc1cn(nc(-c2ccnn2-c2ccccc2)c1=O)-c1ccc2N(C)C(=O)C(C)(C)c2c1F
InChI Key: InChIKey=ABMHXLCXDKBARY-UHFFFAOYSA-N
Data: 1 IC50
Activity Spreadsheet -- Enzyme Inhibition Constant Data from BindingDB
Found 1 hit for monomerid = 50129264
Trg + Lig
Ki
nM
ΔG°
kcal/mole
IC50
nM
Kd
nM
EC50/IC50
nM
koff
s-1
kon
M-1s-1
pHTemp
°C
cAMP and cAMP-inhibited cGMP 3',5'-cyclic phosphodiesterase 10A
(Homo sapiens (Human))
BDBM50129264
(CHEMBL3629732)
Show SMILES COc1cn(nc(-c2ccnn2-c2ccccc2)c1=O)-c1ccc2N(C)C(=O)C(C)(C)c2c1F
Show InChI InChI=1S/C25H22FN5O3/c1-25(2)20-16(29(3)24(25)33)10-11-17(21(20)26)30-14-19(34-4)23(32)22(28-30)18-12-13-27-31(18)15-8-6-5-7-9-15/h5-14H,1-4H3
Reactome pathway
n/an/a 0.220n/an/an/an/an/an/a
Takeda Pharmaceutical Company Limited
Curated by ChEMBL
Assay Description
Inhibition of human PDE10A2 expressed in COS-7 cells using [3H]cGMP as substrate assessed as substrate hydrolysis after 60 mins by scintillation prox...
Bioorg Med Chem 23: 7138-49 (2015)
BindingDB Entry DOI: 10.7270/Q2NG4SGN