BDBM50129266 CHEMBL3629541
SMILES: COc1cn(nc(-c2ccnn2-c2ccccc2)c1=O)-c1ccc(cc1F)N1CCCC1=O
InChI Key: InChIKey=OFVFNTBDENFPGH-UHFFFAOYSA-N
Data: 1 IC50
Activity Spreadsheet -- Enzyme Inhibition Constant Data from BindingDB
Found 1 hit for monomerid = 50129266
Trg + Lig
Ki
nM
ΔG°
kcal/mole
IC50
nM
Kd
nM
EC50/IC50
nM
koff
s-1
kon
M-1s-1
pHTemp
°C
cAMP and cAMP-inhibited cGMP 3',5'-cyclic phosphodiesterase 10A
(Homo sapiens (Human))
BDBM50129266
(CHEMBL3629541)
Show SMILES COc1cn(nc(-c2ccnn2-c2ccccc2)c1=O)-c1ccc(cc1F)N1CCCC1=O
Show InChI InChI=1S/C24H20FN5O3/c1-33-21-15-29(19-10-9-17(14-18(19)25)28-13-5-8-22(28)31)27-23(24(21)32)20-11-12-26-30(20)16-6-3-2-4-7-16/h2-4,6-7,9-12,14-15H,5,8,13H2,1H3
Reactome pathway
n/an/a 0.790n/an/an/an/an/an/a
Takeda Pharmaceutical Company Limited
Curated by ChEMBL
Assay Description
Inhibition of human PDE10A2 expressed in COS-7 cells using [3H]cGMP as substrate assessed as substrate hydrolysis after 60 mins by scintillation prox...
Bioorg Med Chem 23: 7138-49 (2015)
BindingDB Entry DOI: 10.7270/Q2NG4SGN