BDBM50129325 2-[(2-Hydroxymethyl-cyclopropanecarbonyl)-amino]-benzothiazole-6-carboxylic acid (2-chloro-6-methyl-phenyl)-amide::CHEMBL68261
SMILES: Cc1cccc(Cl)c1NC(=O)c1ccc2nc(NC(=O)C3CC3CO)sc2c1
InChI Key: InChIKey=BZYZDQJLCCLWKI-UHFFFAOYSA-N
Data: 1 IC50
Activity Spreadsheet -- Enzyme Inhibition Constant Data from BindingDB
Found 1 hit for monomerid = 50129325
Trg + Lig
Ki
nM
ΔG°
kcal/mole
IC50
nM
Kd
nM
EC50/IC50
nM
koff
s-1
kon
M-1s-1
pHTemp
°C
Tyrosine-protein kinase Lck
(Homo sapiens (Human))
BDBM50129325
(2-[(2-Hydroxymethyl-cyclopropanecarbonyl)-amino]-b...)
Show SMILES Cc1cccc(Cl)c1NC(=O)c1ccc2nc(NC(=O)C3CC3CO)sc2c1
Show InChI InChI=1S/C20H18ClN3O3S/c1-10-3-2-4-14(21)17(10)23-18(26)11-5-6-15-16(8-11)28-20(22-15)24-19(27)13-7-12(13)9-25/h2-6,8,12-13,25H,7,9H2,1H3,(H,23,26)(H,22,24,27)
n/an/a 3n/an/an/an/an/an/a
Bristol-Myers Squibb Pharmaceutical Research Institute
Curated by ChEMBL
Assay Description
Inhibition of human Lck protein tyrosine kinase
Bioorg Med Chem Lett 13: 2145-9 (2003)
BindingDB Entry DOI: 10.7270/Q2F76BZ1