BDBM50129378 CHEMBL3627975
SMILES: CC(=O)Nc1c(Cl)cc(CN\C(N)=N\C(=O)[C@@H]2C[C@@H](CN2c2ccccc2)Oc2ccccc2)cc1Cl
InChI Key: InChIKey=VHNFIXHOLBUZDE-URXFXBBRSA-N
Data: 1 KI
Activity Spreadsheet -- Enzyme Inhibition Constant Data from BindingDB
Found 1 hit for monomerid = 50129378
Trg + Lig
Ki
nM
ΔG°
kcal/mole
IC50
nM
Kd
nM
EC50/IC50
nM
koff
s-1
kon
M-1s-1
pHTemp
°C
Beta-secretase 1
(Homo sapiens (Human))
BDBM50129378
(CHEMBL3627975)
Show SMILES CC(=O)Nc1c(Cl)cc(CN\C(N)=N\C(=O)[C@@H]2C[C@@H](CN2c2ccccc2)Oc2ccccc2)cc1Cl |r|
Show InChI InChI=1S/C27H27Cl2N5O3/c1-17(35)32-25-22(28)12-18(13-23(25)29)15-31-27(30)33-26(36)24-14-21(37-20-10-6-3-7-11-20)16-34(24)19-8-4-2-5-9-19/h2-13,21,24H,14-16H2,1H3,(H,32,35)(H3,30,31,33,36)/t21-,24-/m0/s1
1.90E+3n/an/an/an/an/an/a5.0n/a
Bristol-Myers Squibb Company
Curated by ChEMBL
Assay Description
Displacement of [3H]BMS-599240 from BACE1 (unknown origin) expressed in HEK293 cells at pH 5 after 1.5 hrs by Microbeta liquid scintillation counting...
Bioorg Med Chem Lett 25: 5040-7 (2015)
BindingDB Entry DOI: 10.7270/Q2CZ390J