null
SMILES: CC(=O)O[C@@H]1[C@@H](COC(=O)\C=C\c2ccc(O)cc2)O[C@@H](Oc2c(oc3cc(O)cc(O)c3c2=O)-c2ccc(O)cc2)[C@H](OC(=O)\C=C\c2ccc(O)cc2)[C@H]1OC(C)=O
InChI Key: InChIKey=IFLHDGGEJKVLAF-FEMPFSAESA-N
Activity Spreadsheet -- Enzyme Inhibition Constant Data from BindingDB
Found 5 hits for monomerid = 50129414
Trg + Lig
Ki
nM
ΔG°
kcal/mole
IC50
nM
Kd
nM
EC50/IC50
nM
koff
s-1
kon
M-1s-1
pHTemp
°C
Carbonic anhydrase 7
(Homo sapiens (Human))
BDBM50129414
(CHEMBL3628130)
Show SMILES CC(=O)O[C@@H]1[C@@H](COC(=O)\C=C\c2ccc(O)cc2)O[C@@H](Oc2c(oc3cc(O)cc(O)c3c2=O)-c2ccc(O)cc2)[C@H](OC(=O)\C=C\c2ccc(O)cc2)[C@H]1OC(C)=O |r|
Show InChI InChI=1S/C43H36O17/c1-22(44)55-39-33(21-54-34(51)17-7-24-3-11-27(46)12-4-24)58-43(42(41(39)56-23(2)45)59-35(52)18-8-25-5-13-28(47)14-6-25)60-40-37(53)36-31(50)19-30(49)20-32(36)57-38(40)26-9-15-29(48)16-10-26/h3-20,33,39,41-43,46-50H,21H2,1-2H3/b17-7+,18-8+/t33-,39-,41+,42-,43+/m1/s1
Reactome pathway
27 -10.3n/an/an/an/an/an/a25
Aristotle University of Thessaloniki
Curated by ChEMBL
Assay Description
Inhibition of human recombinant carbonic anhydrase 7 preincubated for 15 mins at room temperature/6 hrs at 4 deg C by stopped-flow CO2 hydration assa...
Bioorg Med Chem 23: 7219-25 (2015)
BindingDB Entry DOI: 10.7270/Q2862J84
Carbonic anhydrase 4
(Homo sapiens (Human))
BDBM50129414
(CHEMBL3628130)
Show SMILES CC(=O)O[C@@H]1[C@@H](COC(=O)\C=C\c2ccc(O)cc2)O[C@@H](Oc2c(oc3cc(O)cc(O)c3c2=O)-c2ccc(O)cc2)[C@H](OC(=O)\C=C\c2ccc(O)cc2)[C@H]1OC(C)=O |r|
Show InChI InChI=1S/C43H36O17/c1-22(44)55-39-33(21-54-34(51)17-7-24-3-11-27(46)12-4-24)58-43(42(41(39)56-23(2)45)59-35(52)18-8-25-5-13-28(47)14-6-25)60-40-37(53)36-31(50)19-30(49)20-32(36)57-38(40)26-9-15-29(48)16-10-26/h3-20,33,39,41-43,46-50H,21H2,1-2H3/b17-7+,18-8+/t33-,39-,41+,42-,43+/m1/s1
Reactome pathway
62 -9.83n/an/an/an/an/an/a25
Aristotle University of Thessaloniki
Curated by ChEMBL
Assay Description
Inhibition of human recombinant carbonic anhydrase 4 preincubated for 15 mins at room temperature/6 hrs at 4 deg C by stopped-flow CO2 hydration assa...
Bioorg Med Chem 23: 7219-25 (2015)
BindingDB Entry DOI: 10.7270/Q2862J84
Carbonic anhydrase 12
(Homo sapiens (Human))
BDBM50129414
(CHEMBL3628130)
Show SMILES CC(=O)O[C@@H]1[C@@H](COC(=O)\C=C\c2ccc(O)cc2)O[C@@H](Oc2c(oc3cc(O)cc(O)c3c2=O)-c2ccc(O)cc2)[C@H](OC(=O)\C=C\c2ccc(O)cc2)[C@H]1OC(C)=O |r|
Show InChI InChI=1S/C43H36O17/c1-22(44)55-39-33(21-54-34(51)17-7-24-3-11-27(46)12-4-24)58-43(42(41(39)56-23(2)45)59-35(52)18-8-25-5-13-28(47)14-6-25)60-40-37(53)36-31(50)19-30(49)20-32(36)57-38(40)26-9-15-29(48)16-10-26/h3-20,33,39,41-43,46-50H,21H2,1-2H3/b17-7+,18-8+/t33-,39-,41+,42-,43+/m1/s1
Reactome pathway
400 -8.72n/an/an/an/an/an/a25
Aristotle University of Thessaloniki
Curated by ChEMBL
Assay Description
Inhibition of human recombinant carbonic anhydrase 12 preincubated for 15 mins at room temperature/6 hrs at 4 deg C by stopped-flow CO2 hydration ass...
Bioorg Med Chem 23: 7219-25 (2015)
BindingDB Entry DOI: 10.7270/Q2862J84
Carbonic anhydrase 2
(Homo sapiens (Human))
BDBM50129414
(CHEMBL3628130)
Show SMILES CC(=O)O[C@@H]1[C@@H](COC(=O)\C=C\c2ccc(O)cc2)O[C@@H](Oc2c(oc3cc(O)cc(O)c3c2=O)-c2ccc(O)cc2)[C@H](OC(=O)\C=C\c2ccc(O)cc2)[C@H]1OC(C)=O |r|
Show InChI InChI=1S/C43H36O17/c1-22(44)55-39-33(21-54-34(51)17-7-24-3-11-27(46)12-4-24)58-43(42(41(39)56-23(2)45)59-35(52)18-8-25-5-13-28(47)14-6-25)60-40-37(53)36-31(50)19-30(49)20-32(36)57-38(40)26-9-15-29(48)16-10-26/h3-20,33,39,41-43,46-50H,21H2,1-2H3/b17-7+,18-8+/t33-,39-,41+,42-,43+/m1/s1
Reactome pathway
6.86E+3 -7.04n/an/an/an/an/an/a25
Aristotle University of Thessaloniki
Curated by ChEMBL
Assay Description
Inhibition of human recombinant carbonic anhydrase 2 preincubated for 15 mins at room temperature/6 hrs at 4 deg C by stopped-flow CO2 hydration assa...
Bioorg Med Chem 23: 7219-25 (2015)
BindingDB Entry DOI: 10.7270/Q2862J84
Carbonic anhydrase 1
(Homo sapiens (Human))
BDBM50129414
(CHEMBL3628130)
Show SMILES CC(=O)O[C@@H]1[C@@H](COC(=O)\C=C\c2ccc(O)cc2)O[C@@H](Oc2c(oc3cc(O)cc(O)c3c2=O)-c2ccc(O)cc2)[C@H](OC(=O)\C=C\c2ccc(O)cc2)[C@H]1OC(C)=O |r|
Show InChI InChI=1S/C43H36O17/c1-22(44)55-39-33(21-54-34(51)17-7-24-3-11-27(46)12-4-24)58-43(42(41(39)56-23(2)45)59-35(52)18-8-25-5-13-28(47)14-6-25)60-40-37(53)36-31(50)19-30(49)20-32(36)57-38(40)26-9-15-29(48)16-10-26/h3-20,33,39,41-43,46-50H,21H2,1-2H3/b17-7+,18-8+/t33-,39-,41+,42-,43+/m1/s1
NCI pathway
Reactome pathway
>1.00E+4>-6.82n/an/an/an/an/an/a25
Aristotle University of Thessaloniki
Curated by ChEMBL
Assay Description
Inhibition of human recombinant carbonic anhydrase 1 preincubated for 15 mins at room temperature/6 hrs at 4 deg C by stopped-flow CO2 hydration assa...
Bioorg Med Chem 23: 7219-25 (2015)
BindingDB Entry DOI: 10.7270/Q2862J84