BDBM50129433 CHEMBL71327::N-{(E)-4-[4-(2,3-Dichloro-phenyl)-piperazin-1-yl]-but-2-enyl}-benzamide::N-{4-[4-(2,3-Dichloro-phenyl)-piperazin-1-yl]-but-2-enyl}-benzamide
SMILES: Clc1cccc(N2CCN(C\C=C\CNC(=O)c3ccccc3)CC2)c1Cl
InChI Key: InChIKey=DHOCETPWLQILEE-SNAWJCMRSA-N
Data: 10 KI  3 IC50  1 EC50
Activity Spreadsheet -- Enzyme Inhibition Constant Data from BindingDB
Found 14 hits for monomerid = 50129433
Trg + Lig
Ki
nM
ΔG°
kcal/mole
IC50
nM
Kd
nM
EC50/IC50
nM
koff
s-1
kon
M-1s-1
pHTemp
°C
D(3) dopamine receptor
(Homo sapiens (Human))
BDBM50129433
(CHEMBL71327 | N-{(E)-4-[4-(2,3-Dichloro-phenyl)-pi...)
Show SMILES Clc1cccc(N2CCN(C\C=C\CNC(=O)c3ccccc3)CC2)c1Cl
Show InChI InChI=1S/C21H23Cl2N3O/c22-18-9-6-10-19(20(18)23)26-15-13-25(14-16-26)12-5-4-11-24-21(27)17-7-2-1-3-8-17/h1-10H,11-16H2,(H,24,27)/b5-4+
0.800n/an/an/an/an/an/an/an/a
National Institute on Drug Abuse-Intramural Research Program
Curated by ChEMBL
Assay Description
Inhibition of [125I]IABN binding to human Dopamine D3 receptor expressed in HEK 293 cells
J Med Chem 48: 3663-79 (2005)
Article DOI: 10.1021/jm040190e
BindingDB Entry DOI: 10.7270/Q2474BNF
D(3) dopamine receptor
(Homo sapiens (Human))
BDBM50129433
(CHEMBL71327 | N-{(E)-4-[4-(2,3-Dichloro-phenyl)-pi...)
Show SMILES Clc1cccc(N2CCN(C\C=C\CNC(=O)c3ccccc3)CC2)c1Cl
Show InChI InChI=1S/C21H23Cl2N3O/c22-18-9-6-10-19(20(18)23)26-15-13-25(14-16-26)12-5-4-11-24-21(27)17-7-2-1-3-8-17/h1-10H,11-16H2,(H,24,27)/b5-4+
0.800n/an/an/an/an/an/an/an/a
National Institute on Drug Abuse-Intramural Research Program
Curated by ChEMBL
Assay Description
Binding affinity for human dopamine D3 receptor
J Med Chem 48: 839-48 (2005)
Article DOI: 10.1021/jm049465g
BindingDB Entry DOI: 10.7270/Q27H1J4R
D(3) dopamine receptor
(Rattus norvegicus (Rat))
BDBM50129433
(CHEMBL71327 | N-{(E)-4-[4-(2,3-Dichloro-phenyl)-pi...)
Show SMILES Clc1cccc(N2CCN(C\C=C\CNC(=O)c3ccccc3)CC2)c1Cl
Show InChI InChI=1S/C21H23Cl2N3O/c22-18-9-6-10-19(20(18)23)26-15-13-25(14-16-26)12-5-4-11-24-21(27)17-7-2-1-3-8-17/h1-10H,11-16H2,(H,24,27)/b5-4+
1.30n/an/an/an/an/an/an/an/a
National Institute on Drug Abuse-Intramural Research Program
Curated by ChEMBL
Assay Description
Binding affinity towards rat Dopamine receptor D3 in Sf9 cells expressing in recombinant baculovirus (Bv) using [125I]-IABN as radioligand
Bioorg Med Chem Lett 13: 2179-83 (2003)
BindingDB Entry DOI: 10.7270/Q21Z43SN
D(3) dopamine receptor
(Rattus norvegicus (Rat))
BDBM50129433
(CHEMBL71327 | N-{(E)-4-[4-(2,3-Dichloro-phenyl)-pi...)
Show SMILES Clc1cccc(N2CCN(C\C=C\CNC(=O)c3ccccc3)CC2)c1Cl
Show InChI InChI=1S/C21H23Cl2N3O/c22-18-9-6-10-19(20(18)23)26-15-13-25(14-16-26)12-5-4-11-24-21(27)17-7-2-1-3-8-17/h1-10H,11-16H2,(H,24,27)/b5-4+
1.30n/an/an/an/an/an/an/an/a
National Institute on Drug Abuse-Intramural Research Program
Curated by ChEMBL
Assay Description
Inhibition of [125I]IABN binding to rat Dopamine D3 receptor expressed in HEK 293 cells
J Med Chem 48: 3663-79 (2005)
Article DOI: 10.1021/jm040190e
BindingDB Entry DOI: 10.7270/Q2474BNF
D(2) dopamine receptor
(Homo sapiens (Human))
BDBM50129433
(CHEMBL71327 | N-{(E)-4-[4-(2,3-Dichloro-phenyl)-pi...)
Show SMILES Clc1cccc(N2CCN(C\C=C\CNC(=O)c3ccccc3)CC2)c1Cl
Show InChI InChI=1S/C21H23Cl2N3O/c22-18-9-6-10-19(20(18)23)26-15-13-25(14-16-26)12-5-4-11-24-21(27)17-7-2-1-3-8-17/h1-10H,11-16H2,(H,24,27)/b5-4+
Reactome pathway
2.90n/an/an/an/an/an/an/an/a
National Institute on Drug Abuse-Intramural Research Program
Curated by ChEMBL
Assay Description
Inhibition of [125I]IABN binding to human Dopamine D2L receptor expressed in HEK 293 cells
J Med Chem 48: 3663-79 (2005)
Article DOI: 10.1021/jm040190e
BindingDB Entry DOI: 10.7270/Q2474BNF
D(2) dopamine receptor
(Homo sapiens (Human))
BDBM50129433
(CHEMBL71327 | N-{(E)-4-[4-(2,3-Dichloro-phenyl)-pi...)
Show SMILES Clc1cccc(N2CCN(C\C=C\CNC(=O)c3ccccc3)CC2)c1Cl
Show InChI InChI=1S/C21H23Cl2N3O/c22-18-9-6-10-19(20(18)23)26-15-13-25(14-16-26)12-5-4-11-24-21(27)17-7-2-1-3-8-17/h1-10H,11-16H2,(H,24,27)/b5-4+
Reactome pathway
2.90n/an/an/an/an/an/an/an/a
National Institute on Drug Abuse-Intramural Research Program
Curated by ChEMBL
Assay Description
Binding affinity for human dopamine D2 receptor
J Med Chem 48: 839-48 (2005)
Article DOI: 10.1021/jm049465g
BindingDB Entry DOI: 10.7270/Q27H1J4R
D(3) dopamine receptor
(Homo sapiens (Human))
BDBM50129433
(CHEMBL71327 | N-{(E)-4-[4-(2,3-Dichloro-phenyl)-pi...)
Show SMILES Clc1cccc(N2CCN(C\C=C\CNC(=O)c3ccccc3)CC2)c1Cl
Show InChI InChI=1S/C21H23Cl2N3O/c22-18-9-6-10-19(20(18)23)26-15-13-25(14-16-26)12-5-4-11-24-21(27)17-7-2-1-3-8-17/h1-10H,11-16H2,(H,24,27)/b5-4+
6.02n/an/an/an/an/an/an/an/a
National Institute on Drug Abuse-Intramural Research Program
Curated by ChEMBL
Assay Description
Inhibition of [3H]YM-09151-2 binding to human Dopamine D3 receptor expressed in CHO cells
J Med Chem 48: 3663-79 (2005)
Article DOI: 10.1021/jm040190e
BindingDB Entry DOI: 10.7270/Q2474BNF
D(2) dopamine receptor
(Homo sapiens (Human))
BDBM50129433
(CHEMBL71327 | N-{(E)-4-[4-(2,3-Dichloro-phenyl)-pi...)
Show SMILES Clc1cccc(N2CCN(C\C=C\CNC(=O)c3ccccc3)CC2)c1Cl
Show InChI InChI=1S/C21H23Cl2N3O/c22-18-9-6-10-19(20(18)23)26-15-13-25(14-16-26)12-5-4-11-24-21(27)17-7-2-1-3-8-17/h1-10H,11-16H2,(H,24,27)/b5-4+
Reactome pathway
23.4n/an/an/an/an/an/an/an/a
National Institute on Drug Abuse-Intramural Research Program
Curated by ChEMBL
Assay Description
Inhibition of [3H]YM-09151-2 binding to human Dopamine D2L receptor expressed in CHO cells
J Med Chem 48: 3663-79 (2005)
Article DOI: 10.1021/jm040190e
BindingDB Entry DOI: 10.7270/Q2474BNF
D(2) dopamine receptor
(Rattus norvegicus (rat))
BDBM50129433
(CHEMBL71327 | N-{(E)-4-[4-(2,3-Dichloro-phenyl)-pi...)
Show SMILES Clc1cccc(N2CCN(C\C=C\CNC(=O)c3ccccc3)CC2)c1Cl
Show InChI InChI=1S/C21H23Cl2N3O/c22-18-9-6-10-19(20(18)23)26-15-13-25(14-16-26)12-5-4-11-24-21(27)17-7-2-1-3-8-17/h1-10H,11-16H2,(H,24,27)/b5-4+
Reactome pathway
50n/an/an/an/an/an/an/an/a
National Institute on Drug Abuse-Intramural Research Program
Curated by ChEMBL
Assay Description
Binding affinity towards rat Dopamine receptor D2 in Sf9 cells expressing in recombinant baculovirus (Bv) using [125I]-IABN as radioligand
Bioorg Med Chem Lett 13: 2179-83 (2003)
BindingDB Entry DOI: 10.7270/Q21Z43SN
D(2) dopamine receptor
(Rattus norvegicus (rat))
BDBM50129433
(CHEMBL71327 | N-{(E)-4-[4-(2,3-Dichloro-phenyl)-pi...)
Show SMILES Clc1cccc(N2CCN(C\C=C\CNC(=O)c3ccccc3)CC2)c1Cl
Show InChI InChI=1S/C21H23Cl2N3O/c22-18-9-6-10-19(20(18)23)26-15-13-25(14-16-26)12-5-4-11-24-21(27)17-7-2-1-3-8-17/h1-10H,11-16H2,(H,24,27)/b5-4+
Reactome pathway
50.1n/an/an/an/an/an/an/an/a
National Institute on Drug Abuse-Intramural Research Program
Curated by ChEMBL
Assay Description
Inhibition of [125I]IABN binding to rat Dopamine D2L receptor expressed in HEK 293 cells
J Med Chem 48: 3663-79 (2005)
Article DOI: 10.1021/jm040190e
BindingDB Entry DOI: 10.7270/Q2474BNF
D(2) dopamine receptor
(Homo sapiens (Human))
BDBM50129433
(CHEMBL71327 | N-{(E)-4-[4-(2,3-Dichloro-phenyl)-pi...)
Show SMILES Clc1cccc(N2CCN(C\C=C\CNC(=O)c3ccccc3)CC2)c1Cl
Show InChI InChI=1S/C21H23Cl2N3O/c22-18-9-6-10-19(20(18)23)26-15-13-25(14-16-26)12-5-4-11-24-21(27)17-7-2-1-3-8-17/h1-10H,11-16H2,(H,24,27)/b5-4+
Reactome pathway
n/an/a 16.1n/an/an/an/an/an/a
National Institute on Drug Abuse-Intramural Research Program
Curated by ChEMBL
Assay Description
Mitogenic stimulation or antagonism of 30 nM quinpirole-stimulated mitogenesis in CHO cells expressing human dopamine D2 receptor
J Med Chem 48: 3663-79 (2005)
Article DOI: 10.1021/jm040190e
BindingDB Entry DOI: 10.7270/Q2474BNF
D(3) dopamine receptor
(Homo sapiens (Human))
BDBM50129433
(CHEMBL71327 | N-{(E)-4-[4-(2,3-Dichloro-phenyl)-pi...)
Show SMILES Clc1cccc(N2CCN(C\C=C\CNC(=O)c3ccccc3)CC2)c1Cl
Show InChI InChI=1S/C21H23Cl2N3O/c22-18-9-6-10-19(20(18)23)26-15-13-25(14-16-26)12-5-4-11-24-21(27)17-7-2-1-3-8-17/h1-10H,11-16H2,(H,24,27)/b5-4+
n/an/a 7.71n/an/an/an/an/an/a
National Institute on Drug Abuse-Intramural Research Program
Curated by ChEMBL
Assay Description
Mitogenic stimulation or antagonism of 30 nM quinpirole-stimulated mitogenesis in CHO cells expressing human dopamine D3 receptor
J Med Chem 48: 3663-79 (2005)
Article DOI: 10.1021/jm040190e
BindingDB Entry DOI: 10.7270/Q2474BNF
D(3) dopamine receptor
(Homo sapiens (Human))
BDBM50129433
(CHEMBL71327 | N-{(E)-4-[4-(2,3-Dichloro-phenyl)-pi...)
Show SMILES Clc1cccc(N2CCN(C\C=C\CNC(=O)c3ccccc3)CC2)c1Cl
Show InChI InChI=1S/C21H23Cl2N3O/c22-18-9-6-10-19(20(18)23)26-15-13-25(14-16-26)12-5-4-11-24-21(27)17-7-2-1-3-8-17/h1-10H,11-16H2,(H,24,27)/b5-4+
n/an/a 7.70n/an/an/an/an/an/a
National Institute on Drug Abuse-Intramural Research Program
Curated by ChEMBL
Assay Description
Stimulation of quinpirole stimulation of mitogenesis in human Dopamine receptor D3 transfected CHO cells
Bioorg Med Chem Lett 13: 2179-83 (2003)
BindingDB Entry DOI: 10.7270/Q21Z43SN
D(3) dopamine receptor
(Homo sapiens (Human))
BDBM50129433
(CHEMBL71327 | N-{(E)-4-[4-(2,3-Dichloro-phenyl)-pi...)
Show SMILES Clc1cccc(N2CCN(C\C=C\CNC(=O)c3ccccc3)CC2)c1Cl
Show InChI InChI=1S/C21H23Cl2N3O/c22-18-9-6-10-19(20(18)23)26-15-13-25(14-16-26)12-5-4-11-24-21(27)17-7-2-1-3-8-17/h1-10H,11-16H2,(H,24,27)/b5-4+
n/an/an/an/a>1.00E+4n/an/an/an/a
National Institute on Drug Abuse-Intramural Research Program
Curated by ChEMBL
Assay Description
Agonistic activity of quinpirole stimulation of mitogenesis in human dopamine D3 transfected CHO cells
Bioorg Med Chem Lett 13: 2179-83 (2003)
BindingDB Entry DOI: 10.7270/Q21Z43SN