BDBM50129508 CHEMBL305191::N-[2-(3,4-Dichloro-phenyl)-4-(4-[1,2,4]triazol-1-yl-piperidin-1-yl)-butyl]-N-methyl-benzamide
SMILES: CN(CC(CCN1CCC(CC1)n1cncn1)c1ccc(Cl)c(Cl)c1)C(=O)c1ccccc1
InChI Key: InChIKey=DWDYAJWQAYFICQ-UHFFFAOYSA-N
Data: 1 IC50
Activity Spreadsheet -- Enzyme Inhibition Constant Data from BindingDB
Found 1 hit for monomerid = 50129508
Trg + Lig
Ki
nM
ΔG°
kcal/mole
IC50
nM
Kd
nM
EC50/IC50
nM
koff
s-1
kon
M-1s-1
pHTemp
°C
Neurokinin 2 receptor
(Homo sapiens (Human))
BDBM50129508
(CHEMBL305191 | N-[2-(3,4-Dichloro-phenyl)-4-(4-[1,...)
Show SMILES CN(CC(CCN1CCC(CC1)n1cncn1)c1ccc(Cl)c(Cl)c1)C(=O)c1ccccc1
Show InChI InChI=1S/C25H29Cl2N5O/c1-30(25(33)19-5-3-2-4-6-19)16-21(20-7-8-23(26)24(27)15-20)9-12-31-13-10-22(11-14-31)32-18-28-17-29-32/h2-8,15,17-18,21-22H,9-14,16H2,1H3
Reactome pathway
n/an/a 6.80n/an/an/an/an/an/a
Pfizer Global Research and Development
Curated by ChEMBL
Assay Description
Binding affinity for human tachykinin receptor 2 expressed in CHO cells using [125I]- NKA radioligand
Bioorg Med Chem Lett 13: 2211-5 (2003)
BindingDB Entry DOI: 10.7270/Q2D799TN