BDBM50129556 CHEMBL3628129
SMILES: O[C@@H]1[C@@H](COC(=O)\C=C\c2ccc(O)cc2)O[C@@H](Oc2c(oc3cc(O)cc(O)c3c2=O)-c2ccc(O)cc2)[C@H](OC(=O)\C=C\c2ccc(O)cc2)[C@H]1O
InChI Key: InChIKey=YXXQUJGFZPLXJV-AIBWQOBZSA-N
Data: 5 KI
Activity Spreadsheet -- Enzyme Inhibition Constant Data from BindingDB
Found 5 hits for monomerid = 50129556
Trg + Lig
Ki
nM
ΔG°
kcal/mole
IC50
nM
Kd
nM
EC50/IC50
nM
koff
s-1
kon
M-1s-1
pHTemp
°C
Carbonic anhydrase 7
(Homo sapiens (Human))
BDBM50129556
(CHEMBL3628129)
Show SMILES O[C@@H]1[C@@H](COC(=O)\C=C\c2ccc(O)cc2)O[C@@H](Oc2c(oc3cc(O)cc(O)c3c2=O)-c2ccc(O)cc2)[C@H](OC(=O)\C=C\c2ccc(O)cc2)[C@H]1O |r|
Show InChI InChI=1S/C39H32O15/c40-23-9-1-20(2-10-23)5-15-30(45)50-19-29-33(47)35(49)38(53-31(46)16-6-21-3-11-24(41)12-4-21)39(52-29)54-37-34(48)32-27(44)17-26(43)18-28(32)51-36(37)22-7-13-25(42)14-8-22/h1-18,29,33,35,38-44,47,49H,19H2/b15-5+,16-6+/t29-,33-,35+,38-,39+/m1/s1
Reactome pathway
4.70 -11.4n/an/an/an/an/an/a25
Aristotle University of Thessaloniki
Curated by ChEMBL
Assay Description
Inhibition of human recombinant carbonic anhydrase 7 preincubated for 15 mins at room temperature/6 hrs at 4 deg C by stopped-flow CO2 hydration assa...
Bioorg Med Chem 23: 7219-25 (2015)
BindingDB Entry DOI: 10.7270/Q2862J84
Carbonic anhydrase 4
(Homo sapiens (Human))
BDBM50129556
(CHEMBL3628129)
Show SMILES O[C@@H]1[C@@H](COC(=O)\C=C\c2ccc(O)cc2)O[C@@H](Oc2c(oc3cc(O)cc(O)c3c2=O)-c2ccc(O)cc2)[C@H](OC(=O)\C=C\c2ccc(O)cc2)[C@H]1O |r|
Show InChI InChI=1S/C39H32O15/c40-23-9-1-20(2-10-23)5-15-30(45)50-19-29-33(47)35(49)38(53-31(46)16-6-21-3-11-24(41)12-4-21)39(52-29)54-37-34(48)32-27(44)17-26(43)18-28(32)51-36(37)22-7-13-25(42)14-8-22/h1-18,29,33,35,38-44,47,49H,19H2/b15-5+,16-6+/t29-,33-,35+,38-,39+/m1/s1
Reactome pathway
344 -8.81n/an/an/an/an/an/a25
Aristotle University of Thessaloniki
Curated by ChEMBL
Assay Description
Inhibition of human recombinant carbonic anhydrase 4 preincubated for 15 mins at room temperature/6 hrs at 4 deg C by stopped-flow CO2 hydration assa...
Bioorg Med Chem 23: 7219-25 (2015)
BindingDB Entry DOI: 10.7270/Q2862J84
Carbonic anhydrase 12
(Homo sapiens (Human))
BDBM50129556
(CHEMBL3628129)
Show SMILES O[C@@H]1[C@@H](COC(=O)\C=C\c2ccc(O)cc2)O[C@@H](Oc2c(oc3cc(O)cc(O)c3c2=O)-c2ccc(O)cc2)[C@H](OC(=O)\C=C\c2ccc(O)cc2)[C@H]1O |r|
Show InChI InChI=1S/C39H32O15/c40-23-9-1-20(2-10-23)5-15-30(45)50-19-29-33(47)35(49)38(53-31(46)16-6-21-3-11-24(41)12-4-21)39(52-29)54-37-34(48)32-27(44)17-26(43)18-28(32)51-36(37)22-7-13-25(42)14-8-22/h1-18,29,33,35,38-44,47,49H,19H2/b15-5+,16-6+/t29-,33-,35+,38-,39+/m1/s1
Reactome pathway
409 -8.71n/an/an/an/an/an/a25
Aristotle University of Thessaloniki
Curated by ChEMBL
Assay Description
Inhibition of human recombinant carbonic anhydrase 12 preincubated for 15 mins at room temperature/6 hrs at 4 deg C by stopped-flow CO2 hydration ass...
Bioorg Med Chem 23: 7219-25 (2015)
BindingDB Entry DOI: 10.7270/Q2862J84
Carbonic anhydrase 2
(Homo sapiens (Human))
BDBM50129556
(CHEMBL3628129)
Show SMILES O[C@@H]1[C@@H](COC(=O)\C=C\c2ccc(O)cc2)O[C@@H](Oc2c(oc3cc(O)cc(O)c3c2=O)-c2ccc(O)cc2)[C@H](OC(=O)\C=C\c2ccc(O)cc2)[C@H]1O |r|
Show InChI InChI=1S/C39H32O15/c40-23-9-1-20(2-10-23)5-15-30(45)50-19-29-33(47)35(49)38(53-31(46)16-6-21-3-11-24(41)12-4-21)39(52-29)54-37-34(48)32-27(44)17-26(43)18-28(32)51-36(37)22-7-13-25(42)14-8-22/h1-18,29,33,35,38-44,47,49H,19H2/b15-5+,16-6+/t29-,33-,35+,38-,39+/m1/s1
Reactome pathway
8.79E+3 -6.89n/an/an/an/an/an/a25
Aristotle University of Thessaloniki
Curated by ChEMBL
Assay Description
Inhibition of human recombinant carbonic anhydrase 2 preincubated for 15 mins at room temperature/6 hrs at 4 deg C by stopped-flow CO2 hydration assa...
Bioorg Med Chem 23: 7219-25 (2015)
BindingDB Entry DOI: 10.7270/Q2862J84
Carbonic anhydrase 1
(Homo sapiens (Human))
BDBM50129556
(CHEMBL3628129)
Show SMILES O[C@@H]1[C@@H](COC(=O)\C=C\c2ccc(O)cc2)O[C@@H](Oc2c(oc3cc(O)cc(O)c3c2=O)-c2ccc(O)cc2)[C@H](OC(=O)\C=C\c2ccc(O)cc2)[C@H]1O |r|
Show InChI InChI=1S/C39H32O15/c40-23-9-1-20(2-10-23)5-15-30(45)50-19-29-33(47)35(49)38(53-31(46)16-6-21-3-11-24(41)12-4-21)39(52-29)54-37-34(48)32-27(44)17-26(43)18-28(32)51-36(37)22-7-13-25(42)14-8-22/h1-18,29,33,35,38-44,47,49H,19H2/b15-5+,16-6+/t29-,33-,35+,38-,39+/m1/s1
NCI pathway
Reactome pathway
>1.00E+4>-6.82n/an/an/an/an/an/a25
Aristotle University of Thessaloniki
Curated by ChEMBL
Assay Description
Inhibition of human recombinant carbonic anhydrase 1 preincubated for 15 mins at room temperature/6 hrs at 4 deg C by stopped-flow CO2 hydration assa...
Bioorg Med Chem 23: 7219-25 (2015)
BindingDB Entry DOI: 10.7270/Q2862J84