BDBM50129559 CHEMBL3234071
SMILES: CS(=O)(=O)c1ccc(cc1)-c1cnc2ccc(nn12)-c1cccc(c1)S(C)(=O)=O
InChI Key: InChIKey=JDMXXVFQJAZOTB-UHFFFAOYSA-N
Data: 1 IC50
Activity Spreadsheet -- Enzyme Inhibition Constant Data from BindingDB
Found 1 hit for monomerid = 50129559
Trg + Lig
Ki
nM
ΔG°
kcal/mole
IC50
nM
Kd
nM
EC50/IC50
nM
koff
s-1
kon
M-1s-1
pHTemp
°C
Potassium voltage-gated channel subfamily H member 2
(Homo sapiens (Human))
BDBM50129559
(CHEMBL3234071)
Show SMILES CS(=O)(=O)c1ccc(cc1)-c1cnc2ccc(nn12)-c1cccc(c1)S(C)(=O)=O
Show InChI InChI=1S/C20H17N3O4S2/c1-28(24,25)16-8-6-14(7-9-16)19-13-21-20-11-10-18(22-23(19)20)15-4-3-5-17(12-15)29(2,26)27/h3-13H,1-2H3
Reactome pathway
n/an/a 900n/an/an/an/an/an/a
University of Cape Town
Curated by ChEMBL
Assay Description
Inhibition of human ERG potassium channel by ionworks patch-clamp electrophysiology assay
J Med Chem 58: 8713-22 (2015)
BindingDB Entry DOI: 10.7270/Q24F1SJD