BDBM50129564 (2S,5R,6R)-2'-(cyclohexyloxy)-3,3-dimethyl-7-oxo-4-thia-1-azaspiro[bicyclo[3.2.0]heptane-6,1'-cyclopropane]-2-carboxylic acid 4,4-dioxide::CHEMBL87719
SMILES: CC1(C)[C@@H](N2[C@@H]([C@@]3(C[C@@H]3OC3CCCCC3)C2=O)S1(=O)=O)C(O)=O
InChI Key: InChIKey=KBFIEDQJOLWBJX-FNNPODNZSA-N
Data: 2 IC50
Activity Spreadsheet -- Enzyme Inhibition Constant Data from BindingDB
Found 2 hits for monomerid = 50129564
Trg + Lig
Ki
nM
ΔG°
kcal/mole
IC50
nM
Kd
nM
EC50/IC50
nM
koff
s-1
kon
M-1s-1
pHTemp
°C
Beta-lactamase
(Enterobacter cloacae)
BDBM50129564
((2S,5R,6R)-2'-(cyclohexyloxy)-3,3-dimethyl-7-oxo-4...)
Show SMILES CC1(C)[C@@H](N2[C@@H]([C@@]3(C[C@@H]3OC3CCCCC3)C2=O)S1(=O)=O)C(O)=O
Show InChI InChI=1S/C16H23NO6S/c1-15(2)11(12(18)19)17-13(20)16(14(17)24(15,21)22)8-10(16)23-9-6-4-3-5-7-9/h9-11,14H,3-8H2,1-2H3,(H,18,19)/t10-,11-,14+,16+/m0/s1
n/an/a 30n/an/an/an/an/an/a
Wyeth Research
Curated by ChEMBL
Assay Description
In vitro inhibitory activity against Beta-lactamase AmpC of class C enzyme
J Med Chem 46: 2569-71 (2003)
Article DOI: 10.1021/jm034056q
BindingDB Entry DOI: 10.7270/Q2W66K59
Beta-lactamase
(Enterobacter cloacae)
BDBM50129564
((2S,5R,6R)-2'-(cyclohexyloxy)-3,3-dimethyl-7-oxo-4...)
Show SMILES CC1(C)[C@@H](N2[C@@H]([C@@]3(C[C@@H]3OC3CCCCC3)C2=O)S1(=O)=O)C(O)=O
Show InChI InChI=1S/C16H23NO6S/c1-15(2)11(12(18)19)17-13(20)16(14(17)24(15,21)22)8-10(16)23-9-6-4-3-5-7-9/h9-11,14H,3-8H2,1-2H3,(H,18,19)/t10-,11-,14+,16+/m0/s1
n/an/a 510n/an/an/an/an/an/a
Wyeth Research
Curated by ChEMBL
Assay Description
In vitro inhibitory activity against Beta-lactamase TEM-1 of class A enzyme
J Med Chem 46: 2569-71 (2003)
Article DOI: 10.1021/jm034056q
BindingDB Entry DOI: 10.7270/Q2W66K59