BDBM50129666 3-Phenylacetylamino-pyridine-2-carboxylic acid thiazol-2-ylamide::CHEMBL90827
SMILES: O=C(Cc1ccccc1)Nc1cccnc1C(=O)Nc1nccs1
InChI Key: InChIKey=UAMOZHSQBRRSCA-UHFFFAOYSA-N
Data: 2 IC50
Activity Spreadsheet -- Enzyme Inhibition Constant Data from BindingDB
Found 2 hits for monomerid = 50129666
Trg + Lig
Ki
nM
ΔG°
kcal/mole
IC50
nM
Kd
nM
EC50/IC50
nM
koff
s-1
kon
M-1s-1
pHTemp
°C
Methionine aminopeptidase 1
(Saccharomyces cerevisiae)
BDBM50129666
(3-Phenylacetylamino-pyridine-2-carboxylic acid thi...)
Show SMILES O=C(Cc1ccccc1)Nc1cccnc1C(=O)Nc1nccs1
Show InChI InChI=1S/C17H14N4O2S/c22-14(11-12-5-2-1-3-6-12)20-13-7-4-8-18-15(13)16(23)21-17-19-9-10-24-17/h1-10H,11H2,(H,20,22)(H,19,21,23)
Reactome pathway
n/an/a 820n/an/an/an/an/an/a
Chinese Academy of Sciences
Curated by ChEMBL
Assay Description
Inhibitory activity against type I methionine aminopeptidase from Saccharomyces cerevisiae
J Med Chem 46: 2631-40 (2003)
Article DOI: 10.1021/jm0300532
BindingDB Entry DOI: 10.7270/Q2CF9QTC
Methionine Aminopeptidase (MAP)
(Escherichia coli (strain K12))
BDBM50129666
(3-Phenylacetylamino-pyridine-2-carboxylic acid thi...)
Show SMILES O=C(Cc1ccccc1)Nc1cccnc1C(=O)Nc1nccs1
Show InChI InChI=1S/C17H14N4O2S/c22-14(11-12-5-2-1-3-6-12)20-13-7-4-8-18-15(13)16(23)21-17-19-9-10-24-17/h1-10H,11H2,(H,20,22)(H,19,21,23)
n/an/a 400n/an/an/an/an/an/a
Chinese Academy of Sciences
Curated by ChEMBL
Assay Description
Inhibitory activity against Methionine aminopeptidase 1 from Escherichia coli
J Med Chem 46: 2631-40 (2003)
Article DOI: 10.1021/jm0300532
BindingDB Entry DOI: 10.7270/Q2CF9QTC