BDBM50129716 1,8-diaminooctane::CHEMBL29392::OCTANE 1,8-DIAMINE::Octane-1,8-diamine
SMILES: NCCCCCCCCN
InChI Key: InChIKey=PWGJDPKCLMLPJW-UHFFFAOYSA-N
Data: 1 KI
PDB links: 2 PDB IDs match this monomer.
Activity Spreadsheet -- Enzyme Inhibition Constant Data from BindingDB
Found 1 hit for monomerid = 50129716
Trg + Lig
Ki
nM
ΔG°
kcal/mole
IC50
nM
Kd
nM
EC50/IC50
nM
koff
s-1
kon
M-1s-1
pHTemp
°C
Polyamine oxidase 1
(Zea mays)
BDBM50129716
(1,8-diaminooctane | CHEMBL29392 | OCTANE 1,8-DIAMI...)
Show SMILES NCCCCCCCCN
Show InChI InChI=1S/C8H20N2/c9-7-5-3-1-2-4-6-8-10/h1-10H2
300n/an/an/an/an/an/a6.5n/a
Universit£ degli Studi di Siena
Curated by ChEMBL
Assay Description
Inhibition of maize PAO at pH 6.5 by spectrophotometry-based Dixon plot method
J Med Chem 52: 4774-85 (2009)
Article DOI: 10.1021/jm900371z
BindingDB Entry DOI: 10.7270/Q2TB16W1
3D
3D Structure (crystal)