BDBM50129822 CHEMBL1688539
SMILES: Fc1ccc(Nc2ncnc3ccccc23)cc1Cl
InChI Key: InChIKey=ODUHDKRYKFSJAH-UHFFFAOYSA-N
Data: 2 IC50
Activity Spreadsheet -- Enzyme Inhibition Constant Data from BindingDB
Found 2 hits for monomerid = 50129822
Trg + Lig
Ki
nM
ΔG°
kcal/mole
IC50
nM
Kd
nM
EC50/IC50
nM
koff
s-1
kon
M-1s-1
pHTemp
°C
Vascular endothelial growth factor receptor 2
(Homo sapiens (Human))
BDBM50129822
(CHEMBL1688539)
Show SMILES Fc1ccc(Nc2ncnc3ccccc23)cc1Cl
Show InChI InChI=1S/C14H9ClFN3/c15-11-7-9(5-6-12(11)16)19-14-10-3-1-2-4-13(10)17-8-18-14/h1-8H,(H,17,18,19)
NCI pathway
Reactome pathway
n/an/a>1.00E+4n/an/an/an/an/an/a
Univ. Lille
Curated by ChEMBL
Assay Description
Inhibition of human recombinant VEGFR-2 after 1 hr using [gamma-32P]ATP
Bioorg Med Chem 23: 7340-7 (2015)
BindingDB Entry DOI: 10.7270/Q2BZ67VR
Epidermal growth factor receptor
(Homo sapiens (Human))
BDBM50129822
(CHEMBL1688539)
Show SMILES Fc1ccc(Nc2ncnc3ccccc23)cc1Cl
Show InChI InChI=1S/C14H9ClFN3/c15-11-7-9(5-6-12(11)16)19-14-10-3-1-2-4-13(10)17-8-18-14/h1-8H,(H,17,18,19)
n/an/a 30n/an/an/an/an/an/a
Univ. Lille
Curated by ChEMBL
Assay Description
Inhibition of human EGFR after 1 hr using [gamma-32P]ATP
Bioorg Med Chem 23: 7340-7 (2015)
BindingDB Entry DOI: 10.7270/Q2BZ67VR