BDBM50129866 1-(2-Cyclobutylamino-acetyl)-pyrrolidine-2-carbonitrile::CHEMBL94312
SMILES: O=C(CNC1CCC1)N1CCC[C@H]1C#N
InChI Key: InChIKey=QKSLTXRZWPFUBO-JTQLQIEISA-N
Data: 1 IC50
Activity Spreadsheet -- Enzyme Inhibition Constant Data from BindingDB
Found 1 hit for monomerid = 50129866
Trg + Lig
Ki
nM
ΔG°
kcal/mole
IC50
nM
Kd
nM
EC50/IC50
nM
koff
s-1
kon
M-1s-1
pHTemp
°C
Dipeptidyl peptidase 4
(Homo sapiens (Human))
BDBM50129866
(1-(2-Cyclobutylamino-acetyl)-pyrrolidine-2-carboni...)
Show SMILES O=C(CNC1CCC1)N1CCC[C@H]1C#N
Show InChI InChI=1S/C11H17N3O/c12-7-10-5-2-6-14(10)11(15)8-13-9-3-1-4-9/h9-10,13H,1-6,8H2/t10-/m0/s1
Reactome pathway
n/an/a 80n/an/an/an/an/an/a
Novartis Institute for Biomedical Research
Curated by ChEMBL
Assay Description
Inhibition of human dipeptidyl peptidase IV (DPP IV) obtained from human colonic carcinoma cells
J Med Chem 46: 2774-89 (2003)
Article DOI: 10.1021/jm030091l
BindingDB Entry DOI: 10.7270/Q20001HR