BDBM50129897 1-(2-Amino-3-methyl-butyryl)-pyrrolidine-2-carbonitrile::CHEMBL96666
SMILES: CC(C)[C@H](N)C(=O)N1CCC[C@H]1C#N
InChI Key: InChIKey=CHAWYGKIDMHIDF-IENPIDJESA-N
Data: 1 IC50
Activity Spreadsheet -- Enzyme Inhibition Constant Data from BindingDB
Found 1 hit for monomerid = 50129897
Trg + Lig
Ki
nM
ΔG°
kcal/mole
IC50
nM
Kd
nM
EC50/IC50
nM
koff
s-1
kon
M-1s-1
pHTemp
°C
Dipeptidyl peptidase 4
(Homo sapiens (Human))
BDBM50129897
(1-(2-Amino-3-methyl-butyryl)-pyrrolidine-2-carboni...)
Show SMILES CC(C)[C@H](N)C(=O)N1CCC[C@H]1C#N
Show InChI InChI=1S/C10H17N3O/c1-7(2)9(12)10(14)13-5-3-4-8(13)6-11/h7-9H,3-5,12H2,1-2H3/t8-,9?/m0/s1
Reactome pathway
n/an/a 2n/an/an/an/an/an/a
Novartis Institute for Biomedical Research
Curated by ChEMBL
Assay Description
Inhibition of human dipeptidyl peptidase IV (DPP IV) obtained from human colonic carcinoma cells
J Med Chem 46: 2774-89 (2003)
Article DOI: 10.1021/jm030091l
BindingDB Entry DOI: 10.7270/Q20001HR