BDBM50129964 1-[2-(4-Carbamimidoyl-phenoxy)-4-methyl-quinolin-7-yl]-cyclopentanecarboxylic acid ethyl ester::CHEMBL75828
SMILES: CCOC(=O)C1(CCCC1)c1ccc2c(C)cc(Oc3ccc(cc3)C(N)=N)nc2c1
InChI Key: InChIKey=XCVKPLFBAXRCKB-UHFFFAOYSA-N
Data: 8 IC50
Activity Spreadsheet -- Enzyme Inhibition Constant Data from BindingDB
Found 8 hits for monomerid = 50129964
Trg + Lig
Ki
nM
ΔG°
kcal/mole
IC50
nM
Kd
nM
EC50/IC50
nM
koff
s-1
kon
M-1s-1
pHTemp
°C
Trypsin-1
(Homo sapiens (Human))
BDBM50129964
(1-[2-(4-Carbamimidoyl-phenoxy)-4-methyl-quinolin-7...)
Show SMILES CCOC(=O)C1(CCCC1)c1ccc2c(C)cc(Oc3ccc(cc3)C(N)=N)nc2c1
Show InChI InChI=1S/C25H27N3O3/c1-3-30-24(29)25(12-4-5-13-25)18-8-11-20-16(2)14-22(28-21(20)15-18)31-19-9-6-17(7-10-19)23(26)27/h6-11,14-15H,3-5,12-13H2,1-2H3,(H3,26,27)
Reactome pathway
n/an/a 560n/an/an/an/an/an/a
Boehringer Ingelheim Pharma KG
Curated by ChEMBL
Assay Description
Inhibitory activity of the compound against trypsin
Bioorg Med Chem Lett 13: 2291-5 (2003)
BindingDB Entry DOI: 10.7270/Q2QJ7GP2
Coagulation factor X
(Homo sapiens (Human))
BDBM50129964
(1-[2-(4-Carbamimidoyl-phenoxy)-4-methyl-quinolin-7...)
Show SMILES CCOC(=O)C1(CCCC1)c1ccc2c(C)cc(Oc3ccc(cc3)C(N)=N)nc2c1
Show InChI InChI=1S/C25H27N3O3/c1-3-30-24(29)25(12-4-5-13-25)18-8-11-20-16(2)14-22(28-21(20)15-18)31-19-9-6-17(7-10-19)23(26)27/h6-11,14-15H,3-5,12-13H2,1-2H3,(H3,26,27)
Reactome pathway
n/an/a 1.50E+3n/an/an/an/an/an/a
Boehringer Ingelheim Pharma KG
Curated by ChEMBL
Assay Description
Inhibitory activity of the compound against coagulation factor X in human plasma
Bioorg Med Chem Lett 13: 2291-5 (2003)
BindingDB Entry DOI: 10.7270/Q2QJ7GP2
Prothrombin
(Homo sapiens (Human))
BDBM50129964
(1-[2-(4-Carbamimidoyl-phenoxy)-4-methyl-quinolin-7...)
Show SMILES CCOC(=O)C1(CCCC1)c1ccc2c(C)cc(Oc3ccc(cc3)C(N)=N)nc2c1
Show InChI InChI=1S/C25H27N3O3/c1-3-30-24(29)25(12-4-5-13-25)18-8-11-20-16(2)14-22(28-21(20)15-18)31-19-9-6-17(7-10-19)23(26)27/h6-11,14-15H,3-5,12-13H2,1-2H3,(H3,26,27)
n/an/a 3n/an/an/an/an/an/a
Boehringer Ingelheim Pharma KG
Curated by ChEMBL
Assay Description
In vitro inhibitory activity against thrombin in human plasma
Bioorg Med Chem Lett 13: 2291-5 (2003)
BindingDB Entry DOI: 10.7270/Q2QJ7GP2
Prothrombin
(Homo sapiens (Human))
BDBM50129964
(1-[2-(4-Carbamimidoyl-phenoxy)-4-methyl-quinolin-7...)
Show SMILES CCOC(=O)C1(CCCC1)c1ccc2c(C)cc(Oc3ccc(cc3)C(N)=N)nc2c1
Show InChI InChI=1S/C25H27N3O3/c1-3-30-24(29)25(12-4-5-13-25)18-8-11-20-16(2)14-22(28-21(20)15-18)31-19-9-6-17(7-10-19)23(26)27/h6-11,14-15H,3-5,12-13H2,1-2H3,(H3,26,27)
n/an/a 3n/an/an/an/an/an/a
China Pharmaceutical University
Curated by ChEMBL
Assay Description
Inhibition of thrombin (unknown origin)
Bioorg Med Chem 25: 458-470 (2017)
Article DOI: 10.1016/j.bmc.2016.11.012
BindingDB Entry DOI: 10.7270/Q21J9CSQ
Plasminogen
(Homo sapiens (Human))
BDBM50129964
(1-[2-(4-Carbamimidoyl-phenoxy)-4-methyl-quinolin-7...)
Show SMILES CCOC(=O)C1(CCCC1)c1ccc2c(C)cc(Oc3ccc(cc3)C(N)=N)nc2c1
Show InChI InChI=1S/C25H27N3O3/c1-3-30-24(29)25(12-4-5-13-25)18-8-11-20-16(2)14-22(28-21(20)15-18)31-19-9-6-17(7-10-19)23(26)27/h6-11,14-15H,3-5,12-13H2,1-2H3,(H3,26,27)
NCI pathway
Reactome pathway
n/an/a 5.80E+3n/an/an/an/an/an/a
Boehringer Ingelheim Pharma KG
Curated by ChEMBL
Assay Description
Inhibition of plasmin
Bioorg Med Chem Lett 13: 2297-302 (2003)
BindingDB Entry DOI: 10.7270/Q2KS6QXW
Prothrombin
(Homo sapiens (Human))
BDBM50129964
(1-[2-(4-Carbamimidoyl-phenoxy)-4-methyl-quinolin-7...)
Show SMILES CCOC(=O)C1(CCCC1)c1ccc2c(C)cc(Oc3ccc(cc3)C(N)=N)nc2c1
Show InChI InChI=1S/C25H27N3O3/c1-3-30-24(29)25(12-4-5-13-25)18-8-11-20-16(2)14-22(28-21(20)15-18)31-19-9-6-17(7-10-19)23(26)27/h6-11,14-15H,3-5,12-13H2,1-2H3,(H3,26,27)
n/an/a 30n/an/an/an/an/an/a
Boehringer Ingelheim Pharma KG
Curated by ChEMBL
Assay Description
Inhibition of human thrombin
Bioorg Med Chem Lett 13: 2297-302 (2003)
BindingDB Entry DOI: 10.7270/Q2KS6QXW
Coagulation factor X
(Homo sapiens (Human))
BDBM50129964
(1-[2-(4-Carbamimidoyl-phenoxy)-4-methyl-quinolin-7...)
Show SMILES CCOC(=O)C1(CCCC1)c1ccc2c(C)cc(Oc3ccc(cc3)C(N)=N)nc2c1
Show InChI InChI=1S/C25H27N3O3/c1-3-30-24(29)25(12-4-5-13-25)18-8-11-20-16(2)14-22(28-21(20)15-18)31-19-9-6-17(7-10-19)23(26)27/h6-11,14-15H,3-5,12-13H2,1-2H3,(H3,26,27)
Reactome pathway
n/an/a 1.50E+3n/an/an/an/an/an/a
Boehringer Ingelheim Pharma KG
Curated by ChEMBL
Assay Description
Inhibition of coagulation factor X
Bioorg Med Chem Lett 13: 2297-302 (2003)
BindingDB Entry DOI: 10.7270/Q2KS6QXW
Plasminogen
(Homo sapiens (Human))
BDBM50129964
(1-[2-(4-Carbamimidoyl-phenoxy)-4-methyl-quinolin-7...)
Show SMILES CCOC(=O)C1(CCCC1)c1ccc2c(C)cc(Oc3ccc(cc3)C(N)=N)nc2c1
Show InChI InChI=1S/C25H27N3O3/c1-3-30-24(29)25(12-4-5-13-25)18-8-11-20-16(2)14-22(28-21(20)15-18)31-19-9-6-17(7-10-19)23(26)27/h6-11,14-15H,3-5,12-13H2,1-2H3,(H3,26,27)
NCI pathway
Reactome pathway
n/an/a 5.80E+3n/an/an/an/an/an/a
Boehringer Ingelheim Pharma KG
Curated by ChEMBL
Assay Description
Inhibitory activity of the compound against plasmin in human plasma
Bioorg Med Chem Lett 13: 2291-5 (2003)
BindingDB Entry DOI: 10.7270/Q2QJ7GP2