BDBM50130301 CHEMBL3632877
SMILES: CC(C)Nc1ccc(-c2ccccc2)c(CC(=O)NCc2ccc(cc2)C(N)=N)c1F
InChI Key: InChIKey=IJHKSKJRRNOZMS-UHFFFAOYSA-N
Data: 1 IC50
Activity Spreadsheet -- Enzyme Inhibition Constant Data from BindingDB
Found 1 hit for monomerid = 50130301
Trg + Lig
Ki
nM
ΔG°
kcal/mole
IC50
nM
Kd
nM
EC50/IC50
nM
koff
s-1
kon
M-1s-1
pHTemp
°C
Coagulation factor III/Factor VIIa (fVIIa)
(Homo sapiens (Human))
BDBM50130301
(CHEMBL3632877)
Show SMILES CC(C)Nc1ccc(-c2ccccc2)c(CC(=O)NCc2ccc(cc2)C(N)=N)c1F
Show InChI InChI=1S/C25H27FN4O/c1-16(2)30-22-13-12-20(18-6-4-3-5-7-18)21(24(22)26)14-23(31)29-15-17-8-10-19(11-9-17)25(27)28/h3-13,16,30H,14-15H2,1-2H3,(H3,27,28)(H,29,31)
n/an/a 340n/an/an/an/an/an/a
Bristol-Myers Squibb Research and Development
Curated by ChEMBL
Assay Description
Inhibition of recombinant human Tissue factor/factor 7a using N-methylsulfonyl-D-phe-gly-arg-p-nitroaniline as substrate assessed as release of p-nit...
J Med Chem 58: 8315-59 (2015)
BindingDB Entry DOI: 10.7270/Q22J6DPZ