BDBM50130302 CHEMBL3632867
SMILES: CC[C@@H](C)[C@H](N)C(=O)N1CC(F)(F)C[C@H]1C#N
InChI Key: InChIKey=FGXCQYPLGGTWJZ-VGMNWLOBSA-N
Data: 1 IC50
Activity Spreadsheet -- Enzyme Inhibition Constant Data from BindingDB
Found 1 hit for monomerid = 50130302
Trg + Lig
Ki
nM
ΔG°
kcal/mole
IC50
nM
Kd
nM
EC50/IC50
nM
koff
s-1
kon
M-1s-1
pHTemp
°C
Dipeptidyl peptidase 4
(Homo sapiens (Human))
BDBM50130302
(CHEMBL3632867)
Show SMILES CC[C@@H](C)[C@H](N)C(=O)N1CC(F)(F)C[C@H]1C#N |r|
Show InChI InChI=1S/C11H17F2N3O/c1-3-7(2)9(15)10(17)16-6-11(12,13)4-8(16)5-14/h7-9H,3-4,6,15H2,1-2H3/t7-,8+,9+/m1/s1
Reactome pathway
n/an/a 0.800n/an/an/an/an/an/a
Bristol-Myers Squibb Research and Development
Curated by ChEMBL
Assay Description
Inhibition of human plasma DPP-4 using Gly-Pro-4-methylcoumaryl-7-amide as substrate assessed as formation of 7-amino-4-methylcoumarin after 2 hrs by...
J Med Chem 58: 8315-59 (2015)
BindingDB Entry DOI: 10.7270/Q22J6DPZ