BDBM50130408 CHEMBL3633692
SMILES: CCS(=O)(=O)c1ccc(OC)c(Nc2cn(nn2)-c2ccc(O)c(c2)-c2ccccn2)c1
InChI Key: InChIKey=SHHBLMHSEQZHHO-UHFFFAOYSA-N
Data: 1 IC50
Activity Spreadsheet -- Enzyme Inhibition Constant Data from BindingDB
Found 1 hit for monomerid = 50130408
Trg + Lig
Ki
nM
ΔG°
kcal/mole
IC50
nM
Kd
nM
EC50/IC50
nM
koff
s-1
kon
M-1s-1
pHTemp
°C
Vascular endothelial growth factor receptor 2
(Homo sapiens (Human))
BDBM50130408
(CHEMBL3633692)
Show SMILES CCS(=O)(=O)c1ccc(OC)c(Nc2cn(nn2)-c2ccc(O)c(c2)-c2ccccn2)c1
Show InChI InChI=1S/C22H21N5O4S/c1-3-32(29,30)16-8-10-21(31-2)19(13-16)24-22-14-27(26-25-22)15-7-9-20(28)17(12-15)18-6-4-5-11-23-18/h4-14,24,28H,3H2,1-2H3
NCI pathway
Reactome pathway
n/an/a 6.96E+3n/an/an/an/an/an/a
Universit£ de Strasbourg
Curated by ChEMBL
Assay Description
Inhibition of GST-tagged human recombinant VEGFR2 kinase expressed in Sf9 insect cells by radiometric protein kinase assay
Eur J Med Chem 103: 105-22 (2015)
BindingDB Entry DOI: 10.7270/Q2P84DQG