null
SMILES: COc1cccc(c1)S(=O)(=O)Nc1ccc(NS(=O)(=O)c2cccc(OC)c2)c2ccccc12
InChI Key: InChIKey=GRIQSZFMJIFQQJ-UHFFFAOYSA-N
Activity Spreadsheet -- Enzyme Inhibition Constant Data from BindingDB
Found 1 hit for monomerid = 50130541
Trg + Lig
Ki
nM
ΔG°
kcal/mole
IC50
nM
Kd
nM
EC50/IC50
nM
koff
s-1
kon
M-1s-1
pHTemp
°C
Kelch-like ECH-associated protein 1
(Homo sapiens (Human))
BDBM50130541
(CHEMBL3632699)
Show SMILES COc1cccc(c1)S(=O)(=O)Nc1ccc(NS(=O)(=O)c2cccc(OC)c2)c2ccccc12
Show InChI InChI=1S/C24H22N2O6S2/c1-31-17-7-5-9-19(15-17)33(27,28)25-23-13-14-24(22-12-4-3-11-21(22)23)26-34(29,30)20-10-6-8-18(16-20)32-2/h3-16,25-26H,1-2H3
n/an/a 2.30E+3n/an/an/an/an/an/a
University of Illinois at Chicago
Curated by ChEMBL
Assay Description
Binding affinity to the Keap1 (321 to 609 residues) (unknown origin) expressed in Escherichia coli BL21 (DE3) cells by surface plasmon resonance assa...
Eur J Med Chem 103: 252-68 (2015)
BindingDB Entry DOI: 10.7270/Q25B04BR