BDBM50130699 1-(5-Hydroxymethyl-2,5-dihydro-furan-2-yl)-5-methyl-1H-pyrimidine-2,4-dione; triphosphate::CHEMBL320969
SMILES: Cc1cn([C@@H]2O[C@H](COP([O-])(=O)OP([O-])(=O)OP([O-])([O-])=O)C=C2)c(=O)[nH]c1=O
InChI Key: InChIKey=ODSQODTUNULBHF-JGVFFNPUSA-J
Data: 1 IC50
Activity Spreadsheet -- Enzyme Inhibition Constant Data from BindingDB
Found 1 hit for monomerid = 50130699
Trg + Lig
Ki
nM
ΔG°
kcal/mole
IC50
nM
Kd
nM
EC50/IC50
nM
koff
s-1
kon
M-1s-1
pHTemp
°C
Human immunodeficiency virus type 1 reverse transcriptase
(Human immunodeficiency virus 1)
BDBM50130699
(1-(5-Hydroxymethyl-2,5-dihydro-furan-2-yl)-5-methy...)
Show SMILES Cc1cn([C@@H]2O[C@H](COP([O-])(=O)OP([O-])(=O)OP([O-])([O-])=O)C=C2)c(=O)[nH]c1=O |c:21|
Show InChI InChI=1S/C10H15N2O13P3/c1-6-4-12(10(14)11-9(6)13)8-3-2-7(23-8)5-22-27(18,19)25-28(20,21)24-26(15,16)17/h2-4,7-8H,5H2,1H3,(H,18,19)(H,20,21)(H,11,13,14)(H2,15,16,17)/p-4/t7-,8+/m0/s1
n/an/a 80n/an/an/an/an/an/a
National Cancer Institute-Frederick
Curated by ChEMBL
Assay Description
Inhibitory concentration required against Reverse transcriptase (RT)
J Med Chem 46: 3292-9 (2003)
Article DOI: 10.1021/jm030116g
BindingDB Entry DOI: 10.7270/Q2PR7WRP