BDBM50130734 CHEMBL3632931
SMILES: Cc1cc(no1)-c1onc(C)c1C(=O)Sc1ccccc1
InChI Key: InChIKey=DVFCSRCPPGGKJA-UHFFFAOYSA-N
Data: 1 IC50
Activity Spreadsheet -- Enzyme Inhibition Constant Data from BindingDB
Found 1 hit for monomerid = 50130734
Trg + Lig
Ki
nM
ΔG°
kcal/mole
IC50
nM
Kd
nM
EC50/IC50
nM
koff
s-1
kon
M-1s-1
pHTemp
°C
Pregnane X receptor
(Homo sapiens (Human))
BDBM50130734
(CHEMBL3632931)
Show SMILES Cc1cc(no1)-c1onc(C)c1C(=O)Sc1ccccc1
Show InChI InChI=1S/C15H12N2O3S/c1-9-8-12(17-19-9)14-13(10(2)16-20-14)15(18)21-11-6-4-3-5-7-11/h3-8H,1-2H3
n/an/a 850n/an/an/an/an/an/a
University of Ljubljana
Curated by ChEMBL
Assay Description
Antagonist activity at PXR (unknown origin)
Eur J Med Chem 103: 551-62 (2015)
BindingDB Entry DOI: 10.7270/Q2N87CMJ