BDBM50130774 CHEMBL115375::CHEMBL611757::{4-[6-(Allyl-methyl-amino)-hexyloxy]-2-hydroxy-phenyl}-(4-bromo-phenyl)-methanone; fumarate
SMILES: CN(CCCCCCOc1ccc(C(=O)c2ccc(Br)cc2)c(O)c1)CC=C
InChI Key: InChIKey=OZNGQEACJHMNOT-UHFFFAOYSA-N
Data: 2 IC50
Activity Spreadsheet -- Enzyme Inhibition Constant Data from BindingDB
Found 2 hits for monomerid = 50130774
Trg + Lig
Ki
nM
ΔG°
kcal/mole
IC50
nM
Kd
nM
EC50/IC50
nM
koff
s-1
kon
M-1s-1
pHTemp
°C
Lanosterol synthase
(Homo sapiens (Human))
BDBM50130774
(CHEMBL115375 | CHEMBL611757 | {4-[6-(Allyl-methyl-...)
Show SMILES CN(CCCCCCOc1ccc(C(=O)c2ccc(Br)cc2)c(O)c1)CC=C
Show InChI InChI=1S/C23H28BrNO3/c1-3-14-25(2)15-6-4-5-7-16-28-20-12-13-21(22(26)17-20)23(27)18-8-10-19(24)11-9-18/h3,8-13,17,26H,1,4-7,14-16H2,2H3
Reactome pathway
n/an/a 6.30n/an/an/an/an/an/a
Universit£ di Torino
Curated by ChEMBL
Assay Description
Inhibition of oxidosqualene cyclase
J Med Chem 50: 5039-42 (2007)
Article DOI: 10.1021/jm0704651
BindingDB Entry DOI: 10.7270/Q2ZP47FF
Lanosterol synthase
(Homo sapiens (Human))
BDBM50130774
(CHEMBL115375 | CHEMBL611757 | {4-[6-(Allyl-methyl-...)
Show SMILES CN(CCCCCCOc1ccc(C(=O)c2ccc(Br)cc2)c(O)c1)CC=C
Show InChI InChI=1S/C23H28BrNO3/c1-3-14-25(2)15-6-4-5-7-16-28-20-12-13-21(22(26)17-20)23(27)18-8-10-19(24)11-9-18/h3,8-13,17,26H,1,4-7,14-16H2,2H3
Reactome pathway
n/an/a 6.30n/an/an/an/an/an/a
F. Hoffmann-La Roche Ltd.
Curated by ChEMBL
Assay Description
In vitro inhibition of human 2,3-oxidosqualene cyclase.
J Med Chem 46: 3354-70 (2003)
Article DOI: 10.1021/jm021120f
BindingDB Entry DOI: 10.7270/Q29G5NKM