BDBM50130825 1-Methyl-3-[5-(5-nitro-indol-1-yl)-pentyloxycarbonyl]-pyridinium; iodide::CHEMBL325011
SMILES: C[n+]1cccc(c1)C(=O)OCCCCCn1ccc2cc(ccc12)[N+]([O-])=O
InChI Key: InChIKey=VIRCQTGEUMRMNX-UHFFFAOYSA-N
Data: 1 IC50
Activity Spreadsheet -- Enzyme Inhibition Constant Data from BindingDB
Found 1 hit for monomerid = 50130825
Trg + Lig
Ki
nM
ΔG°
kcal/mole
IC50
nM
Kd
nM
EC50/IC50
nM
koff
s-1
kon
M-1s-1
pHTemp
°C
NH(3)-dependent NAD(+) synthetase
(Bacillus subtilis)
BDBM50130825
(1-Methyl-3-[5-(5-nitro-indol-1-yl)-pentyloxycarbon...)
Show SMILES C[n+]1cccc(c1)C(=O)OCCCCCn1ccc2cc(ccc12)[N+]([O-])=O
Show InChI InChI=1S/C20H22N3O4/c1-21-10-5-6-17(15-21)20(24)27-13-4-2-3-11-22-12-9-16-14-18(23(25)26)7-8-19(16)22/h5-10,12,14-15H,2-4,11,13H2,1H3/q+1
n/an/a 1.00E+6n/an/an/an/an/an/a
University of Alabama at Birmingham
Curated by ChEMBL
Assay Description
Inhibitory activity against Bacillus subtilis NAD synthetase
J Med Chem 46: 3371-81 (2003)
Article DOI: 10.1021/jm030003x
BindingDB Entry DOI: 10.7270/Q25T3M6Q