BDBM50130831 3-[7-(2-Methoxycarbonyl-indol-1-yl)-heptyloxycarbonyl]-1-methyl-pyridinium; iodide::CHEMBL114098
SMILES: COC(=O)c1cc2ccccc2n1CCCCCCCOC(=O)c1ccc[n+](C)c1
InChI Key: InChIKey=HTJNPKQGGFOIBC-UHFFFAOYSA-N
Data: 1 IC50
Activity Spreadsheet -- Enzyme Inhibition Constant Data from BindingDB
Found 1 hit for monomerid = 50130831
Trg + Lig
Ki
nM
ΔG°
kcal/mole
IC50
nM
Kd
nM
EC50/IC50
nM
koff
s-1
kon
M-1s-1
pHTemp
°C
NH(3)-dependent NAD(+) synthetase
(Bacillus subtilis)
BDBM50130831
(3-[7-(2-Methoxycarbonyl-indol-1-yl)-heptyloxycarbo...)
Show SMILES COC(=O)c1cc2ccccc2n1CCCCCCCOC(=O)c1ccc[n+](C)c1
Show InChI InChI=1S/C24H29N2O4/c1-25-14-10-12-20(18-25)23(27)30-16-9-5-3-4-8-15-26-21-13-7-6-11-19(21)17-22(26)24(28)29-2/h6-7,10-14,17-18H,3-5,8-9,15-16H2,1-2H3/q+1
n/an/a 3.40E+4n/an/an/an/an/an/a
University of Alabama at Birmingham
Curated by ChEMBL
Assay Description
Inhibitory activity against Bacillus subtilis NAD synthetase
J Med Chem 46: 3371-81 (2003)
Article DOI: 10.1021/jm030003x
BindingDB Entry DOI: 10.7270/Q25T3M6Q