BDBM50130922 CHEMBL3632941
SMILES: [H][C@@]12CC[C@@]3(C)[C@@]([H])(C=CC4=C([C@H](C)CC(=O)[C@H](O)C(C)(C)O)C(=O)C[C@]34C)[C@@]1(C)CCC(=O)C2(C)C
InChI Key: InChIKey=GHJSMGTZWLBPHU-DSAUVPRUSA-N
Data: 1 IC50  1 EC50
Activity Spreadsheet -- Enzyme Inhibition Constant Data from BindingDB
Found 2 hits for monomerid = 50130922
Trg + Lig
Ki
nM
ΔG°
kcal/mole
IC50
nM
Kd
nM
EC50/IC50
nM
koff
s-1
kon
M-1s-1
pHTemp
°C
Bile acid receptor
(Homo sapiens (Human))
BDBM50130922
(CHEMBL3632941)
Show SMILES [H][C@@]12CC[C@@]3(C)[C@@]([H])(C=CC4=C([C@H](C)CC(=O)[C@H](O)C(C)(C)O)C(=O)C[C@]34C)[C@@]1(C)CCC(=O)C2(C)C |r,c:8,10|
Show InChI InChI=1S/C30H44O5/c1-17(15-19(31)25(34)27(4,5)35)24-18-9-10-22-28(6)13-12-23(33)26(2,3)21(28)11-14-29(22,7)30(18,8)16-20(24)32/h9-10,17,21-22,25,34-35H,11-16H2,1-8H3/t17-,21+,22+,25+,28+,29+,30+/m1/s1
NCI pathway
Reactome pathway
n/an/an/an/a 1.55E+4n/an/an/an/a
Dalian Medical University
Curated by ChEMBL
Assay Description
Transactivation of FXR (unknown origin) transfected in HepG2 cells co-expressing pBSEP/pGL4.74 incubated for 24 hrs by luciferase reporter gene assay
Eur J Med Chem 182: (2019)
Article DOI: 10.1016/j.ejmech.2019.111652
Cocaine esterase
(Homo sapiens (Human))
BDBM50130922
(CHEMBL3632941)
Show SMILES [H][C@@]12CC[C@@]3(C)[C@@]([H])(C=CC4=C([C@H](C)CC(=O)[C@H](O)C(C)(C)O)C(=O)C[C@]34C)[C@@]1(C)CCC(=O)C2(C)C |r,c:8,10|
Show InChI InChI=1S/C30H44O5/c1-17(15-19(31)25(34)27(4,5)35)24-18-9-10-22-28(6)13-12-23(33)26(2,3)21(28)11-14-29(22,7)30(18,8)16-20(24)32/h9-10,17,21-22,25,34-35H,11-16H2,1-8H3/t17-,21+,22+,25+,28+,29+,30+/m1/s1
NCI pathway
n/an/a 1.01E+4n/an/an/an/an/an/a
Liaoning University of Traditional Chinese Medicine
Curated by ChEMBL
Assay Description
Inhibition of human carboxylesterase 2 using 4-benzoyl-N-butyl-1,8-naphthalimide as substrate by fluorescence assay
J Nat Prod 78: 2372-80 (2015)
BindingDB Entry DOI: 10.7270/Q20K2BDR