BDBM50130950 5-(4-Chloro-phenylsulfanyl)-quinazoline-2,4-diamine::5-[(4-chlorophenyl)sulfanyl]quinazoline-2,4-diamine::5-[(4-chlorophenyl)sulfanyl]quinazoline-2,4-diamine, 2d::CHEMBL310759
SMILES: Nc1nc(N)c2c(Sc3ccc(Cl)cc3)cccc2n1
InChI Key: InChIKey=AVRPDIOCAAWICH-UHFFFAOYSA-N
Data: 3 KI  6 IC50  1 Kd
PDB links: 1 PDB ID matches this monomer.
Activity Spreadsheet -- Enzyme Inhibition Constant Data from BindingDB
Found 10 hits for monomerid = 50130950
Trg + Lig
Ki
nM
ΔG°
kcal/mole
IC50
nM
Kd
nM
EC50/IC50
nM
koff
s-1
kon
M-1s-1
pHTemp
°C
Dihydrofolate Reductase (DHFR)
(Escherichia coli)
BDBM50130950
(5-(4-Chloro-phenylsulfanyl)-quinazoline-2,4-diamin...)
Show SMILES Nc1nc(N)c2c(Sc3ccc(Cl)cc3)cccc2n1
Show InChI InChI=1S/C14H11ClN4S/c15-8-4-6-9(7-5-8)20-11-3-1-2-10-12(11)13(16)19-14(17)18-10/h1-7H,(H4,16,17,18,19)
38n/an/an/an/an/an/an/an/a
McMaster University
Assay Description
Inhibition assay using Esherichia coli dihydrofolate reductase (DHFR).
Chem Biol 11: 1423-30 (2004)
Article DOI: 10.1016/j.chembiol.2004.08.014
BindingDB Entry DOI: 10.7270/Q2639N6G
3D
3D Structure (crystal)
Dihydrofolate reductase
(Escherichia coli)
BDBM50130950
(5-(4-Chloro-phenylsulfanyl)-quinazoline-2,4-diamin...)
Show SMILES Nc1nc(N)c2c(Sc3ccc(Cl)cc3)cccc2n1
Show InChI InChI=1S/C14H11ClN4S/c15-8-4-6-9(7-5-8)20-11-3-1-2-10-12(11)13(16)19-14(17)18-10/h1-7H,(H4,16,17,18,19)
NCI pathway
Reactome pathway
61n/an/an/an/an/an/an/an/a
McMaster University
Curated by ChEMBL
Assay Description
Inhibition of Escherichia coli Dihydrofolate reductase in presence of 100 uM Dihydrofolate reductase
Bioorg Med Chem Lett 13: 2493-6 (2003)
BindingDB Entry DOI: 10.7270/Q2CN74G5
Dihydrofolate reductase
(Escherichia coli)
BDBM50130950
(5-(4-Chloro-phenylsulfanyl)-quinazoline-2,4-diamin...)
Show SMILES Nc1nc(N)c2c(Sc3ccc(Cl)cc3)cccc2n1
Show InChI InChI=1S/C14H11ClN4S/c15-8-4-6-9(7-5-8)20-11-3-1-2-10-12(11)13(16)19-14(17)18-10/h1-7H,(H4,16,17,18,19)
NCI pathway
Reactome pathway
93n/an/an/an/an/an/an/an/a
McMaster University
Curated by ChEMBL
Assay Description
Inhibition of Escherichia coli Dihydrofolate reductase in presence of 100 uM Dihydrofolate reductase
Bioorg Med Chem Lett 13: 2493-6 (2003)
BindingDB Entry DOI: 10.7270/Q2CN74G5
Dihydrofolate reductase
(Escherichia coli)
BDBM50130950
(5-(4-Chloro-phenylsulfanyl)-quinazoline-2,4-diamin...)
Show SMILES Nc1nc(N)c2c(Sc3ccc(Cl)cc3)cccc2n1
Show InChI InChI=1S/C14H11ClN4S/c15-8-4-6-9(7-5-8)20-11-3-1-2-10-12(11)13(16)19-14(17)18-10/h1-7H,(H4,16,17,18,19)
NCI pathway
Reactome pathway
n/an/a 1.00E+3n/an/an/an/an/an/a
McMaster University
Curated by ChEMBL
Assay Description
Inhibition constant against Dihydrofolate reductase
Bioorg Med Chem Lett 13: 2493-6 (2003)
BindingDB Entry DOI: 10.7270/Q2CN74G5
Dihydrofolate reductase
(Escherichia coli)
BDBM50130950
(5-(4-Chloro-phenylsulfanyl)-quinazoline-2,4-diamin...)
Show SMILES Nc1nc(N)c2c(Sc3ccc(Cl)cc3)cccc2n1
Show InChI InChI=1S/C14H11ClN4S/c15-8-4-6-9(7-5-8)20-11-3-1-2-10-12(11)13(16)19-14(17)18-10/h1-7H,(H4,16,17,18,19)
NCI pathway
Reactome pathway
n/an/a 400n/an/an/an/an/an/a
McMaster University
Curated by ChEMBL
Assay Description
Inhibition constant against Dihydrofolate reductase
Bioorg Med Chem Lett 13: 2493-6 (2003)
BindingDB Entry DOI: 10.7270/Q2CN74G5
Dihydrofolate reductase
(Escherichia coli)
BDBM50130950
(5-(4-Chloro-phenylsulfanyl)-quinazoline-2,4-diamin...)
Show SMILES Nc1nc(N)c2c(Sc3ccc(Cl)cc3)cccc2n1
Show InChI InChI=1S/C14H11ClN4S/c15-8-4-6-9(7-5-8)20-11-3-1-2-10-12(11)13(16)19-14(17)18-10/h1-7H,(H4,16,17,18,19)
NCI pathway
Reactome pathway
n/an/a 510n/an/an/an/an/an/a
McMaster University
Curated by ChEMBL
Assay Description
Inhibition of Escherichia coli Dihydrofolate reductase in presence of 100 uM Dihydrofolate reductase
Bioorg Med Chem Lett 13: 2493-6 (2003)
BindingDB Entry DOI: 10.7270/Q2CN74G5
Dihydrofolate Reductase (DHFR)
(Candida albicans)
BDBM50130950
(5-(4-Chloro-phenylsulfanyl)-quinazoline-2,4-diamin...)
Show SMILES Nc1nc(N)c2c(Sc3ccc(Cl)cc3)cccc2n1
Show InChI InChI=1S/C14H11ClN4S/c15-8-4-6-9(7-5-8)20-11-3-1-2-10-12(11)13(16)19-14(17)18-10/h1-7H,(H4,16,17,18,19)
n/an/a 30n/an/an/an/an/an/a
Burroughs Wellcome Company
Curated by ChEMBL
Assay Description
Inhibition of dihydrofolate reductase in Candida albicans (in vitro).
J Med Chem 38: 3608-16 (1995)
BindingDB Entry DOI: 10.7270/Q2V69KS6
Dihydrofolate reductase
(Homo sapiens (Human))
BDBM50130950
(5-(4-Chloro-phenylsulfanyl)-quinazoline-2,4-diamin...)
Show SMILES Nc1nc(N)c2c(Sc3ccc(Cl)cc3)cccc2n1
Show InChI InChI=1S/C14H11ClN4S/c15-8-4-6-9(7-5-8)20-11-3-1-2-10-12(11)13(16)19-14(17)18-10/h1-7H,(H4,16,17,18,19)
NCI pathway
Reactome pathway
n/an/an/a 120n/an/an/an/an/a
Janssen Pharmaceutical Research and Development, LLC
Curated by ChEMBL
Assay Description
Binding affinity to DHFR (unknown origin) by NMR analysis
J Med Chem 57: 7819-37 (2014)
Article DOI: 10.1021/jm500325k
BindingDB Entry DOI: 10.7270/Q2JW8GH3
Dihydrofolate reductase
(Escherichia coli)
BDBM50130950
(5-(4-Chloro-phenylsulfanyl)-quinazoline-2,4-diamin...)
Show SMILES Nc1nc(N)c2c(Sc3ccc(Cl)cc3)cccc2n1
Show InChI InChI=1S/C14H11ClN4S/c15-8-4-6-9(7-5-8)20-11-3-1-2-10-12(11)13(16)19-14(17)18-10/h1-7H,(H4,16,17,18,19)
NCI pathway
Reactome pathway
n/an/a 320n/an/an/an/an/an/a
McMaster University
Curated by ChEMBL
Assay Description
Inhibition of Escherichia coli Dihydrofolate reductase in presence of 30 uM Dihydrofolate reductase
Bioorg Med Chem Lett 13: 2493-6 (2003)
BindingDB Entry DOI: 10.7270/Q2CN74G5
Dihydrofolate reductase
(Homo sapiens (Human))
BDBM50130950
(5-(4-Chloro-phenylsulfanyl)-quinazoline-2,4-diamin...)
Show SMILES Nc1nc(N)c2c(Sc3ccc(Cl)cc3)cccc2n1
Show InChI InChI=1S/C14H11ClN4S/c15-8-4-6-9(7-5-8)20-11-3-1-2-10-12(11)13(16)19-14(17)18-10/h1-7H,(H4,16,17,18,19)
NCI pathway
Reactome pathway
n/an/a 2.10E+3n/an/an/an/an/an/a
Burroughs Wellcome Company
Curated by ChEMBL
Assay Description
In vitro inhibition of human dihydrofolate reductase
J Med Chem 38: 3608-16 (1995)
BindingDB Entry DOI: 10.7270/Q2V69KS6