BDBM50131120 2-(6-Methoxy-pyrimidin-4-ylamino)-benzothiazole-6-carboxylic acid (2-chloro-6-methyl-phenyl)-amide::CHEMBL86738
SMILES: COc1cc(Nc2nc3ccc(cc3s2)C(=O)Nc2c(C)cccc2Cl)ncn1
InChI Key: InChIKey=XZPAQTIEKMWUQB-UHFFFAOYSA-N
Data: 1 IC50
Activity Spreadsheet -- Enzyme Inhibition Constant Data from BindingDB
Found 1 hit for monomerid = 50131120
Trg + Lig
Ki
nM
ΔG°
kcal/mole
IC50
nM
Kd
nM
EC50/IC50
nM
koff
s-1
kon
M-1s-1
pHTemp
°C
Tyrosine-protein kinase Lck
(Homo sapiens (Human))
BDBM50131120
(2-(6-Methoxy-pyrimidin-4-ylamino)-benzothiazole-6-...)
Show SMILES COc1cc(Nc2nc3ccc(cc3s2)C(=O)Nc2c(C)cccc2Cl)ncn1
Show InChI InChI=1S/C20H16ClN5O2S/c1-11-4-3-5-13(21)18(11)26-19(27)12-6-7-14-15(8-12)29-20(24-14)25-16-9-17(28-2)23-10-22-16/h3-10H,1-2H3,(H,26,27)(H,22,23,24,25)
n/an/a 13n/an/an/an/an/an/a
Bristol-Myers Squibb Pharmaceutical Research Institute
Curated by ChEMBL
Assay Description
Inhibition of human p56 Lck tyrosine kinase
Bioorg Med Chem Lett 13: 2587-90 (2003)
BindingDB Entry DOI: 10.7270/Q2FX78V4