BDBM50131133 2-(6-Dimethylaminomethyl-pyridin-2-ylamino)-benzothiazole-6-carboxylic acid (2-chloro-6-methyl-phenyl)-amide::CHEMBL87604
SMILES: CN(C)Cc1cccc(Nc2nc3ccc(cc3s2)C(=O)Nc2c(C)cccc2Cl)n1
InChI Key: InChIKey=WRAFACGJDBYILN-UHFFFAOYSA-N
Data: 1 IC50
Activity Spreadsheet -- Enzyme Inhibition Constant Data from BindingDB
Found 1 hit for monomerid = 50131133
Trg + Lig
Ki
nM
ΔG°
kcal/mole
IC50
nM
Kd
nM
EC50/IC50
nM
koff
s-1
kon
M-1s-1
pHTemp
°C
Tyrosine-protein kinase Lck
(Homo sapiens (Human))
BDBM50131133
(2-(6-Dimethylaminomethyl-pyridin-2-ylamino)-benzot...)
Show SMILES CN(C)Cc1cccc(Nc2nc3ccc(cc3s2)C(=O)Nc2c(C)cccc2Cl)n1
Show InChI InChI=1S/C23H22ClN5OS/c1-14-6-4-8-17(24)21(14)28-22(30)15-10-11-18-19(12-15)31-23(26-18)27-20-9-5-7-16(25-20)13-29(2)3/h4-12H,13H2,1-3H3,(H,28,30)(H,25,26,27)
n/an/a 10n/an/an/an/an/an/a
Bristol-Myers Squibb Pharmaceutical Research Institute
Curated by ChEMBL
Assay Description
Inhibition of human p56 Lck tyrosine kinase
Bioorg Med Chem Lett 13: 2587-90 (2003)
BindingDB Entry DOI: 10.7270/Q2FX78V4