BDBM50131137 2-(2-Methyl-6-methylaminomethyl-pyrimidin-4-ylamino)-benzothiazole-6-carboxylic acid (2-chloro-6-methyl-phenyl)-amide::CHEMBL315778
SMILES: CNCc1cc(Nc2nc3ccc(cc3s2)C(=O)Nc2c(C)cccc2Cl)nc(C)n1
InChI Key: InChIKey=XSIHGLBVVSVKBH-UHFFFAOYSA-N
Data: 2 IC50
Activity Spreadsheet -- Enzyme Inhibition Constant Data from BindingDB
Found 2 hits for monomerid = 50131137
Trg + Lig
Ki
nM
ΔG°
kcal/mole
IC50
nM
Kd
nM
EC50/IC50
nM
koff
s-1
kon
M-1s-1
pHTemp
°C
Tyrosine-protein kinase Lck
(Homo sapiens (Human))
BDBM50131137
(2-(2-Methyl-6-methylaminomethyl-pyrimidin-4-ylamin...)
Show SMILES CNCc1cc(Nc2nc3ccc(cc3s2)C(=O)Nc2c(C)cccc2Cl)nc(C)n1
Show InChI InChI=1S/C22H21ClN6OS/c1-12-5-4-6-16(23)20(12)29-21(30)14-7-8-17-18(9-14)31-22(27-17)28-19-10-15(11-24-3)25-13(2)26-19/h4-10,24H,11H2,1-3H3,(H,29,30)(H,25,26,27,28)
n/an/a 7n/an/an/an/an/an/a
Bristol-Myers Squibb Pharmaceutical Research Institute
Curated by ChEMBL
Assay Description
Inhibition of human p56 Lck tyrosine kinase
Bioorg Med Chem Lett 13: 2587-90 (2003)
BindingDB Entry DOI: 10.7270/Q2FX78V4
Tyrosine-protein kinase Lck
(Homo sapiens (Human))
BDBM50131137
(2-(2-Methyl-6-methylaminomethyl-pyrimidin-4-ylamin...)
Show SMILES CNCc1cc(Nc2nc3ccc(cc3s2)C(=O)Nc2c(C)cccc2Cl)nc(C)n1
Show InChI InChI=1S/C22H21ClN6OS/c1-12-5-4-6-16(23)20(12)29-21(30)14-7-8-17-18(9-14)31-22(27-17)28-19-10-15(11-24-3)25-13(2)26-19/h4-10,24H,11H2,1-3H3,(H,29,30)(H,25,26,27,28)
n/an/a 7n/an/an/an/an/an/a
Bristol-Myers Squibb Pharmaceutical Research Institute
Curated by ChEMBL
Assay Description
Inhibition of human p56 Lck tyrosine kinase
Bioorg Med Chem Lett 13: 2587-90 (2003)
BindingDB Entry DOI: 10.7270/Q2FX78V4