BDBM50131155 2-(6-Amino-pyridin-2-ylamino)-benzothiazole-6-carboxylic acid (2-chloro-6-methyl-phenyl)-amide::CHEMBL313384
SMILES: Cc1cccc(Cl)c1NC(=O)c1ccc2nc(Nc3cccc(N)n3)sc2c1
InChI Key: InChIKey=UHLYZIUKXJIXGB-UHFFFAOYSA-N
Data: 1 IC50
Activity Spreadsheet -- Enzyme Inhibition Constant Data from BindingDB
Found 1 hit for monomerid = 50131155
Trg + Lig
Ki
nM
ΔG°
kcal/mole
IC50
nM
Kd
nM
EC50/IC50
nM
koff
s-1
kon
M-1s-1
pHTemp
°C
Tyrosine-protein kinase Lck
(Homo sapiens (Human))
BDBM50131155
(2-(6-Amino-pyridin-2-ylamino)-benzothiazole-6-carb...)
Show SMILES Cc1cccc(Cl)c1NC(=O)c1ccc2nc(Nc3cccc(N)n3)sc2c1
Show InChI InChI=1S/C20H16ClN5OS/c1-11-4-2-5-13(21)18(11)26-19(27)12-8-9-14-15(10-12)28-20(23-14)25-17-7-3-6-16(22)24-17/h2-10H,1H3,(H,26,27)(H3,22,23,24,25)
n/an/a 2n/an/an/an/an/an/a
Bristol-Myers Squibb Pharmaceutical Research Institute
Curated by ChEMBL
Assay Description
Inhibition of human p56 Lck tyrosine kinase
Bioorg Med Chem Lett 13: 2587-90 (2003)
BindingDB Entry DOI: 10.7270/Q2FX78V4