BDBM50131164 2-(2-Methyl-6-morpholin-4-ylmethyl-pyrimidin-4-ylamino)-benzothiazole-6-carboxylic acid (2-chloro-6-methyl-phenyl)-amide::CHEMBL84846
SMILES: Cc1cccc(Cl)c1NC(=O)c1ccc2nc(Nc3cc(CN4CCOCC4)nc(C)n3)sc2c1
InChI Key: InChIKey=FEKWJPQIXYYMIL-UHFFFAOYSA-N
Data: 1 IC50
Activity Spreadsheet -- Enzyme Inhibition Constant Data from BindingDB
Found 1 hit for monomerid = 50131164
Trg + Lig
Ki
nM
ΔG°
kcal/mole
IC50
nM
Kd
nM
EC50/IC50
nM
koff
s-1
kon
M-1s-1
pHTemp
°C
Tyrosine-protein kinase Lck
(Homo sapiens (Human))
BDBM50131164
(2-(2-Methyl-6-morpholin-4-ylmethyl-pyrimidin-4-yla...)
Show SMILES Cc1cccc(Cl)c1NC(=O)c1ccc2nc(Nc3cc(CN4CCOCC4)nc(C)n3)sc2c1
Show InChI InChI=1S/C25H25ClN6O2S/c1-15-4-3-5-19(26)23(15)31-24(33)17-6-7-20-21(12-17)35-25(29-20)30-22-13-18(27-16(2)28-22)14-32-8-10-34-11-9-32/h3-7,12-13H,8-11,14H2,1-2H3,(H,31,33)(H,27,28,29,30)
n/an/a 6n/an/an/an/an/an/a
Bristol-Myers Squibb Pharmaceutical Research Institute
Curated by ChEMBL
Assay Description
Inhibition of human p56 Lck tyrosine kinase
Bioorg Med Chem Lett 13: 2587-90 (2003)
BindingDB Entry DOI: 10.7270/Q2FX78V4