BDBM50131203 2-Benzyl-5-phenyl-2H-[1,2,4]triazole-3-thiol::CHEMBL85267
SMILES: S=c1[nH]c(nn1Cc1ccccc1)-c1ccccc1
InChI Key: InChIKey=WNNGZVCTVPBUNB-UHFFFAOYSA-N
Data: 1 IC50
Activity Spreadsheet -- Enzyme Inhibition Constant Data from BindingDB
Found 1 hit for monomerid = 50131203
Trg + Lig
Ki
nM
ΔG°
kcal/mole
IC50
nM
Kd
nM
EC50/IC50
nM
koff
s-1
kon
M-1s-1
pHTemp
°C
C-X-C chemokine receptor type 2
(Homo sapiens (Human))
BDBM50131203
(2-Benzyl-5-phenyl-2H-[1,2,4]triazole-3-thiol | CHE...)
Show SMILES S=c1[nH]c(nn1Cc1ccccc1)-c1ccccc1
Show InChI InChI=1S/C15H13N3S/c19-15-16-14(13-9-5-2-6-10-13)17-18(15)11-12-7-3-1-4-8-12/h1-10H,11H2,(H,16,17,19)
Reactome pathway
n/an/a 2.40E+3n/an/an/an/an/an/a
AstraZeneca R&D Charnwood
Curated by ChEMBL
Assay Description
Inhibition of binding of [125I]-IL8 to human recombinant CXC chemokine receptor 2 (CXCR2) expressed in HEK 293 membranes
Bioorg Med Chem Lett 13: 2625-8 (2003)
BindingDB Entry DOI: 10.7270/Q2B56J5K