BDBM50131229 CHEMBL3634773::US9260425, 368
SMILES: C1CN(CCN1)c1cccc(n1)-c1n[nH]c2cnc(cc12)-n1ccnc1
InChI Key: InChIKey=BDYUVBLOKBRWER-UHFFFAOYSA-N
Data: 4 KI
Activity Spreadsheet -- Enzyme Inhibition Constant Data from BindingDB
Found 4 hits for monomerid = 50131229
Trg + Lig
Ki
nM
ΔG°
kcal/mole
IC50
nM
Kd
nM
EC50/IC50
nM
koff
s-1
kon
M-1s-1
pHTemp
°C
Serine/threonine-protein kinase pim-3
(Homo sapiens (Human))
BDBM50131229
(CHEMBL3634773 | US9260425, 368)
Show SMILES C1CN(CCN1)c1cccc(n1)-c1n[nH]c2cnc(cc12)-n1ccnc1
Show InChI InChI=1S/C18H18N8/c1-2-14(22-16(3-1)25-7-4-19-5-8-25)18-13-10-17(26-9-6-20-12-26)21-11-15(13)23-24-18/h1-3,6,9-12,19H,4-5,7-8H2,(H,23,24)
0.650n/an/an/an/an/an/an/an/a
Genentech
Curated by ChEMBL
Assay Description
Inhibition of Pim3 (unknown origin) using 5FAM-ARKRRRHPSGPPTA as substrate after 90 mins
Bioorg Med Chem Lett 25: 5258-64 (2015)
BindingDB Entry DOI: 10.7270/Q2TT4SR7
Serine/threonine-protein kinase pim-1
(Homo sapiens (Human))
BDBM50131229
(CHEMBL3634773 | US9260425, 368)
Show SMILES C1CN(CCN1)c1cccc(n1)-c1n[nH]c2cnc(cc12)-n1ccnc1
Show InChI InChI=1S/C18H18N8/c1-2-14(22-16(3-1)25-7-4-19-5-8-25)18-13-10-17(26-9-6-20-12-26)21-11-15(13)23-24-18/h1-3,6,9-12,19H,4-5,7-8H2,(H,23,24)
1.80n/an/an/an/an/an/an/an/a
Genentech
Curated by ChEMBL
Assay Description
Inhibition of Pim1 (unknown origin) using 5FAM-ARKRRRHPSGPPTA as substrate after 90 mins
Bioorg Med Chem Lett 25: 5258-64 (2015)
BindingDB Entry DOI: 10.7270/Q2TT4SR7
Serine/threonine-protein kinase pim-1
(Homo sapiens (Human))
BDBM50131229
(CHEMBL3634773 | US9260425, 368)
Show SMILES C1CN(CCN1)c1cccc(n1)-c1n[nH]c2cnc(cc12)-n1ccnc1
Show InChI InChI=1S/C18H18N8/c1-2-14(22-16(3-1)25-7-4-19-5-8-25)18-13-10-17(26-9-6-20-12-26)21-11-15(13)23-24-18/h1-3,6,9-12,19H,4-5,7-8H2,(H,23,24)
US Patent
1.82n/an/an/an/an/an/a7.2n/a
Genetech, Inc.
US Patent
Assay Description
PIM-1, PIM-2, and PIM-3 enzymes were generated as fusion proteins expressed in bacteria and purified by IMAC column chromatography (Sun, X., Chiu, J....
US Patent US9260425 (2016)
BindingDB Entry DOI: 10.7270/Q2RR1X3X
Serine/threonine-protein kinase pim-2
(Homo sapiens (Human))
BDBM50131229
(CHEMBL3634773 | US9260425, 368)
Show SMILES C1CN(CCN1)c1cccc(n1)-c1n[nH]c2cnc(cc12)-n1ccnc1
Show InChI InChI=1S/C18H18N8/c1-2-14(22-16(3-1)25-7-4-19-5-8-25)18-13-10-17(26-9-6-20-12-26)21-11-15(13)23-24-18/h1-3,6,9-12,19H,4-5,7-8H2,(H,23,24)
5.40n/an/an/an/an/an/an/an/a
Genentech
Curated by ChEMBL
Assay Description
Inhibition of Pim2 (unknown origin) using 5FAM-ARKRRRHPSGPPTA as substrate after 90 mins
Bioorg Med Chem Lett 25: 5258-64 (2015)
BindingDB Entry DOI: 10.7270/Q2TT4SR7