BDBM50131272 3-(4-Fluoro-phenyl)-4-[1-(4-pyrrolidin-1-yl-phenyl)-meth-(Z)-ylidene]-4H-isoxazol-5-one::CHEMBL330478
SMILES: Fc1ccc(cc1)C1=NOC(=O)\C1=C/c1ccc(cc1)N1CCCC1
InChI Key: InChIKey=ZUPZXTAXIZNDRJ-AQTBWJFISA-N
Data: 1 Kd
Activity Spreadsheet -- Enzyme Inhibition Constant Data from BindingDB
Found 1 hit for monomerid = 50131272
Trg + Lig
Ki
nM
ΔG°
kcal/mole
IC50
nM
Kd
nM
EC50/IC50
nM
koff
s-1
kon
M-1s-1
pHTemp
°C
Androgen Receptor
(Homo sapiens (Human))
BDBM50131272
(3-(4-Fluoro-phenyl)-4-[1-(4-pyrrolidin-1-yl-phenyl...)
Show SMILES Fc1ccc(cc1)C1=NOC(=O)\C1=C/c1ccc(cc1)N1CCCC1 |t:8|
Show InChI InChI=1S/C20H17FN2O2/c21-16-7-5-15(6-8-16)19-18(20(24)25-22-19)13-14-3-9-17(10-4-14)23-11-1-2-12-23/h3-10,13H,1-2,11-12H2/b18-13-
NCI pathway
Reactome pathway
n/an/an/a 1.40n/an/an/an/an/a
The University of Tokyo
Curated by ChEMBL
Assay Description
Dissociation constant against GST-hARLBD was measured in SC-3 cell by using [3H]-testosterone as radioligand
Bioorg Med Chem Lett 13: 2655-8 (2003)
BindingDB Entry DOI: 10.7270/Q26D5SDD