BDBM50131298 (R)-2-[1-(Formyl-hydroxy-amino)-ethyl]-hexanoic acid ((S)-1-dimethylcarbamoyl-2,2-dimethyl-propyl)-amide::CHEMBL91105
SMILES: CCCC[C@H](C(C)N(O)C=O)C(=O)N[C@H](C(=O)N(C)C)C(C)(C)C
InChI Key: InChIKey=OFWLYSVIODDFPQ-ILMHWDKJSA-N
Data: 1 IC50
Activity Spreadsheet -- Enzyme Inhibition Constant Data from BindingDB
Found 1 hit for monomerid = 50131298
Trg + Lig
Ki
nM
ΔG°
kcal/mole
IC50
nM
Kd
nM
EC50/IC50
nM
koff
s-1
kon
M-1s-1
pHTemp
°C
Peptide deformylase mitochondrial
(Homo sapiens (Human))
BDBM50131298
((R)-2-[1-(Formyl-hydroxy-amino)-ethyl]-hexanoic ac...)
Show SMILES CCCC[C@H](C(C)N(O)C=O)C(=O)N[C@H](C(=O)N(C)C)C(C)(C)C
Show InChI InChI=1S/C17H33N3O4/c1-8-9-10-13(12(2)20(24)11-21)15(22)18-14(17(3,4)5)16(23)19(6)7/h11-14,24H,8-10H2,1-7H3,(H,18,22)/t12?,13-,14-/m1/s1
n/an/a 600n/an/an/an/an/an/a
British Biotech Pharmaceuticals Limited
Curated by ChEMBL
Assay Description
Inhibition against Escherichia coli peptide deformylase
Bioorg Med Chem Lett 13: 2709-13 (2003)
BindingDB Entry DOI: 10.7270/Q2XW4J6S