BDBM50131305 (S)-2-[(R)-3-(Formyl-hydroxy-amino)-2-methyl-propionylamino]-3,3,N,N-tetramethyl-butyramide::CHEMBL92692
SMILES: C[C@H](CN(O)C=O)C(=O)N[C@H](C(=O)N(C)C)C(C)(C)C
InChI Key: InChIKey=PBWGTPRJVMWLJS-NXEZZACHSA-N
Data: 1 IC50
Activity Spreadsheet -- Enzyme Inhibition Constant Data from BindingDB
Found 1 hit for monomerid = 50131305
Trg + Lig
Ki
nM
ΔG°
kcal/mole
IC50
nM
Kd
nM
EC50/IC50
nM
koff
s-1
kon
M-1s-1
pHTemp
°C
Peptide deformylase mitochondrial
(Homo sapiens (Human))
BDBM50131305
((S)-2-[(R)-3-(Formyl-hydroxy-amino)-2-methyl-propi...)
Show SMILES C[C@H](CN(O)C=O)C(=O)N[C@H](C(=O)N(C)C)C(C)(C)C
Show InChI InChI=1S/C13H25N3O4/c1-9(7-16(20)8-17)11(18)14-10(13(2,3)4)12(19)15(5)6/h8-10,20H,7H2,1-6H3,(H,14,18)/t9-,10-/m1/s1
n/an/a 100n/an/an/an/an/an/a
British Biotech Pharmaceuticals Limited
Curated by ChEMBL
Assay Description
Inhibition against Escherichia coli peptide deformylase
Bioorg Med Chem Lett 13: 2709-13 (2003)
BindingDB Entry DOI: 10.7270/Q2XW4J6S