BDBM50131306 (R)-N-((S)-1-Dimethylcarbamoyl-2,2-dimethyl-propyl)-2-[(formyl-hydroxy-amino)-methyl]-3-methyl-butyramide::CHEMBL90378
SMILES: CC(C)[C@H](CN(O)C=O)C(=O)N[C@H](C(=O)N(C)C)C(C)(C)C
InChI Key: InChIKey=KUCDVMJWKRRZCK-NWDGAFQWSA-N
Data: 1 IC50
Activity Spreadsheet -- Enzyme Inhibition Constant Data from BindingDB
Found 1 hit for monomerid = 50131306
Trg + Lig
Ki
nM
ΔG°
kcal/mole
IC50
nM
Kd
nM
EC50/IC50
nM
koff
s-1
kon
M-1s-1
pHTemp
°C
Peptide deformylase mitochondrial
(Homo sapiens (Human))
BDBM50131306
((R)-N-((S)-1-Dimethylcarbamoyl-2,2-dimethyl-propyl...)
Show SMILES CC(C)[C@H](CN(O)C=O)C(=O)N[C@H](C(=O)N(C)C)C(C)(C)C
Show InChI InChI=1S/C15H29N3O4/c1-10(2)11(8-18(22)9-19)13(20)16-12(15(3,4)5)14(21)17(6)7/h9-12,22H,8H2,1-7H3,(H,16,20)/t11-,12+/m0/s1
n/an/a 50n/an/an/an/an/an/a
British Biotech Pharmaceuticals Limited
Curated by ChEMBL
Assay Description
Inhibition against Escherichia coli peptide deformylase
Bioorg Med Chem Lett 13: 2709-13 (2003)
BindingDB Entry DOI: 10.7270/Q2XW4J6S