BDBM50131307 (S)-2-[(R)-2-Cyclopentyl-3-(formyl-hydroxy-amino)-propionylamino]-3,3,N,N-tetramethyl-butyramide::CHEMBL328502
SMILES: CN(C)C(=O)[C@@H](NC(=O)[C@@H](CN(O)C=O)C1CCCC1)C(C)(C)C
InChI Key: InChIKey=TUCKHWCMDLPFLN-UONOGXRCSA-N
Data: 1 IC50
Activity Spreadsheet -- Enzyme Inhibition Constant Data from BindingDB
Found 1 hit for monomerid = 50131307
Trg + Lig
Ki
nM
ΔG°
kcal/mole
IC50
nM
Kd
nM
EC50/IC50
nM
koff
s-1
kon
M-1s-1
pHTemp
°C
Peptide deformylase mitochondrial
(Homo sapiens (Human))
BDBM50131307
((S)-2-[(R)-2-Cyclopentyl-3-(formyl-hydroxy-amino)-...)
Show SMILES CN(C)C(=O)[C@@H](NC(=O)[C@@H](CN(O)C=O)C1CCCC1)C(C)(C)C
Show InChI InChI=1S/C17H31N3O4/c1-17(2,3)14(16(23)19(4)5)18-15(22)13(10-20(24)11-21)12-8-6-7-9-12/h11-14,24H,6-10H2,1-5H3,(H,18,22)/t13-,14+/m0/s1
n/an/a 20n/an/an/an/an/an/a
British Biotech Pharmaceuticals Limited
Curated by ChEMBL
Assay Description
Inhibition against Escherichia coli peptide deformylase
Bioorg Med Chem Lett 13: 2709-13 (2003)
BindingDB Entry DOI: 10.7270/Q2XW4J6S