BDBM50131377 CHEMBL3634781::US9260425, 162
SMILES: C1CN(CCN1)c1cccc(n1)-c1n[nH]c2cnc(cc12)-c1cccnc1
InChI Key: InChIKey=XVJJTRNNWYKRTH-UHFFFAOYSA-N
Data: 4 KI
Activity Spreadsheet -- Enzyme Inhibition Constant Data from BindingDB
Found 4 hits for monomerid = 50131377
Trg + Lig
Ki
nM
ΔG°
kcal/mole
IC50
nM
Kd
nM
EC50/IC50
nM
koff
s-1
kon
M-1s-1
pHTemp
°C
Serine/threonine-protein kinase pim-3
(Homo sapiens (Human))
BDBM50131377
(CHEMBL3634781 | US9260425, 162)
Show SMILES C1CN(CCN1)c1cccc(n1)-c1n[nH]c2cnc(cc12)-c1cccnc1
Show InChI InChI=1S/C20H19N7/c1-4-16(24-19(5-1)27-9-7-21-8-10-27)20-15-11-17(14-3-2-6-22-12-14)23-13-18(15)25-26-20/h1-6,11-13,21H,7-10H2,(H,25,26)
0.0100n/an/an/an/an/an/an/an/a
Genentech
Curated by ChEMBL
Assay Description
Inhibition of Pim3 (unknown origin) using 5FAM-ARKRRRHPSGPPTA as substrate after 90 mins
Bioorg Med Chem Lett 25: 5258-64 (2015)
BindingDB Entry DOI: 10.7270/Q2TT4SR7
Serine/threonine-protein kinase pim-1
(Homo sapiens (Human))
BDBM50131377
(CHEMBL3634781 | US9260425, 162)
Show SMILES C1CN(CCN1)c1cccc(n1)-c1n[nH]c2cnc(cc12)-c1cccnc1
Show InChI InChI=1S/C20H19N7/c1-4-16(24-19(5-1)27-9-7-21-8-10-27)20-15-11-17(14-3-2-6-22-12-14)23-13-18(15)25-26-20/h1-6,11-13,21H,7-10H2,(H,25,26)
US Patent
0.0370n/an/an/an/an/an/a7.2n/a
Genetech, Inc.
US Patent
Assay Description
PIM-1, PIM-2, and PIM-3 enzymes were generated as fusion proteins expressed in bacteria and purified by IMAC column chromatography (Sun, X., Chiu, J....
US Patent US9260425 (2016)
BindingDB Entry DOI: 10.7270/Q2RR1X3X
Serine/threonine-protein kinase pim-1
(Homo sapiens (Human))
BDBM50131377
(CHEMBL3634781 | US9260425, 162)
Show SMILES C1CN(CCN1)c1cccc(n1)-c1n[nH]c2cnc(cc12)-c1cccnc1
Show InChI InChI=1S/C20H19N7/c1-4-16(24-19(5-1)27-9-7-21-8-10-27)20-15-11-17(14-3-2-6-22-12-14)23-13-18(15)25-26-20/h1-6,11-13,21H,7-10H2,(H,25,26)
0.0400n/an/an/an/an/an/an/an/a
Genentech
Curated by ChEMBL
Assay Description
Inhibition of Pim1 (unknown origin) using 5FAM-ARKRRRHPSGPPTA as substrate after 90 mins
Bioorg Med Chem Lett 25: 5258-64 (2015)
BindingDB Entry DOI: 10.7270/Q2TT4SR7
Serine/threonine-protein kinase pim-2
(Homo sapiens (Human))
BDBM50131377
(CHEMBL3634781 | US9260425, 162)
Show SMILES C1CN(CCN1)c1cccc(n1)-c1n[nH]c2cnc(cc12)-c1cccnc1
Show InChI InChI=1S/C20H19N7/c1-4-16(24-19(5-1)27-9-7-21-8-10-27)20-15-11-17(14-3-2-6-22-12-14)23-13-18(15)25-26-20/h1-6,11-13,21H,7-10H2,(H,25,26)
0.5n/an/an/an/an/an/an/an/a
Genentech
Curated by ChEMBL
Assay Description
Inhibition of Pim2 (unknown origin) using 5FAM-ARKRRRHPSGPPTA as substrate after 90 mins
Bioorg Med Chem Lett 25: 5258-64 (2015)
BindingDB Entry DOI: 10.7270/Q2TT4SR7