BDBM50131433 4-(2-(4-(1-(4-fluorobenzyl)-1H-benzo[d]imidazol-2-ylamino)piperidin-1-yl)ethyl)phenol::4-(2-{4-[1-(4-Fluoro-benzyl)-1H-benzoimidazol-2-ylamino]-piperidin-1-yl}-ethyl)-phenol::CHEMBL60796::Desmethylastemizole
SMILES: Oc1ccc(CCN2CCC(CC2)Nc2nc3ccccc3n2Cc2ccc(F)cc2)cc1
InChI Key: InChIKey=LAGYWHSFHIMTPE-UHFFFAOYSA-N
Data: 3 IC50  1 Kd
Activity Spreadsheet -- Enzyme Inhibition Constant Data from BindingDB
Found 4 hits for monomerid = 50131433
Trg + Lig
Ki
nM
ΔG°
kcal/mole
IC50
nM
Kd
nM
EC50/IC50
nM
koff
s-1
kon
M-1s-1
pHTemp
°C
Potassium voltage-gated channel subfamily H member 2
(Homo sapiens (Human))
BDBM50131433
(4-(2-(4-(1-(4-fluorobenzyl)-1H-benzo[d]imidazol-2-...)
Show SMILES Oc1ccc(CCN2CCC(CC2)Nc2nc3ccccc3n2Cc2ccc(F)cc2)cc1
Show InChI InChI=1S/C27H29FN4O/c28-22-9-5-21(6-10-22)19-32-26-4-2-1-3-25(26)30-27(32)29-23-14-17-31(18-15-23)16-13-20-7-11-24(33)12-8-20/h1-12,23,33H,13-19H2,(H,29,30)
Reactome pathway
n/an/a 1n/an/an/an/an/an/a
Gedeon Richter Ltd
Curated by ChEMBL
Assay Description
Inhibition of human Potassium channel HERG expressed in mammalian cells
Bioorg Med Chem Lett 13: 2773-5 (2003)
BindingDB Entry DOI: 10.7270/Q2QZ2BGZ
Nuclear receptor subfamily 4 group A member 2
(Homo sapiens (Human))
BDBM50131433
(4-(2-(4-(1-(4-fluorobenzyl)-1H-benzo[d]imidazol-2-...)
Show SMILES Oc1ccc(CCN2CCC(CC2)Nc2nc3ccccc3n2Cc2ccc(F)cc2)cc1
Show InChI InChI=1S/C27H29FN4O/c28-22-9-5-21(6-10-22)19-32-26-4-2-1-3-25(26)30-27(32)29-23-14-17-31(18-15-23)16-13-20-7-11-24(33)12-8-20/h1-12,23,33H,13-19H2,(H,29,30)
Reactome pathway
n/an/an/a 2.00E+4n/an/an/an/an/a
Lavis
Curated by ChEMBL
Assay Description
Binding affinity to Nurr1 (unknown origin) by 1H-STD-NMR spectroscopy
J Med Chem 62: 2218-2244 (2019)
Article DOI: 10.1021/acs.jmedchem.8b01210
Potassium voltage-gated channel subfamily H member 2
(Homo sapiens (Human))
BDBM50131433
(4-(2-(4-(1-(4-fluorobenzyl)-1H-benzo[d]imidazol-2-...)
Show SMILES Oc1ccc(CCN2CCC(CC2)Nc2nc3ccccc3n2Cc2ccc(F)cc2)cc1
Show InChI InChI=1S/C27H29FN4O/c28-22-9-5-21(6-10-22)19-32-26-4-2-1-3-25(26)30-27(32)29-23-14-17-31(18-15-23)16-13-20-7-11-24(33)12-8-20/h1-12,23,33H,13-19H2,(H,29,30)
Reactome pathway
n/an/a 1n/an/an/an/an/an/a
Universit£ di Pisa
Curated by ChEMBL
Assay Description
Inhibition of human ERG channel in HEK293 cells by voltage-clamp method
Eur J Med Chem 43: 2479-88 (2008)
Article DOI: 10.1016/j.ejmech.2007.12.025
BindingDB Entry DOI: 10.7270/Q2542PTB
Potassium voltage-gated channel subfamily H member 2
(Homo sapiens (Human))
BDBM50131433
(4-(2-(4-(1-(4-fluorobenzyl)-1H-benzo[d]imidazol-2-...)
Show SMILES Oc1ccc(CCN2CCC(CC2)Nc2nc3ccccc3n2Cc2ccc(F)cc2)cc1
Show InChI InChI=1S/C27H29FN4O/c28-22-9-5-21(6-10-22)19-32-26-4-2-1-3-25(26)30-27(32)29-23-14-17-31(18-15-23)16-13-20-7-11-24(33)12-8-20/h1-12,23,33H,13-19H2,(H,29,30)
Reactome pathway
n/an/a 1n/an/an/an/an/an/a
Hoffmann-La Roche
Curated by ChEMBL
Assay Description
Inhibition of human ERG expressed in CHO cells by whole cell patch clamp technique
Bioorg Med Chem 16: 6252-60 (2008)
Article DOI: 10.1016/j.bmc.2008.04.028
BindingDB Entry DOI: 10.7270/Q25D8T25