BDBM50131840 CHEMBL3633142
SMILES: COc1cc(ccc1Nc1ncc2ccc(=O)n(-c3cccc(NC(=O)C=C)c3)c2n1)N1CCN(C)CC1
InChI Key: InChIKey=HOQHLSXELYFJKC-UHFFFAOYSA-N
Data: 1 IC50
Activity Spreadsheet -- Enzyme Inhibition Constant Data from BindingDB
Found 1 hit for monomerid = 50131840
Trg + Lig
Ki
nM
ΔG°
kcal/mole
IC50
nM
Kd
nM
EC50/IC50
nM
koff
s-1
kon
M-1s-1
pHTemp
°C
Epidermal growth factor receptor
(Homo sapiens (Human))
BDBM50131840
(CHEMBL3633142)
Show SMILES COc1cc(ccc1Nc1ncc2ccc(=O)n(-c3cccc(NC(=O)C=C)c3)c2n1)N1CCN(C)CC1
Show InChI InChI=1S/C28H29N7O3/c1-4-25(36)30-20-6-5-7-22(16-20)35-26(37)11-8-19-18-29-28(32-27(19)35)31-23-10-9-21(17-24(23)38-3)34-14-12-33(2)13-15-34/h4-11,16-18H,1,12-15H2,2-3H3,(H,30,36)(H,29,31,32)
n/an/a 50n/an/an/an/an/an/a
Amgen Inc.
Curated by ChEMBL
Assay Description
Binding affinity against delta opioid receptor in mouse hot plate test
ACS Med Chem Lett 6: 987-92 (2015)
BindingDB Entry DOI: 10.7270/Q21C1ZPN