BDBM50132168 CHEMBL103798::Furan-2-ylmethyl-(9-isopropyl-9H-purin-6-yl)-amine
SMILES: CC(C)n1cnc2c(NCc3ccco3)ncnc12
InChI Key: InChIKey=DEPBEEZQRHODQY-UHFFFAOYSA-N
Data: 2 IC50
Activity Spreadsheet -- Enzyme Inhibition Constant Data from BindingDB
Found 2 hits for monomerid = 50132168
Trg + Lig
Ki
nM
ΔG°
kcal/mole
IC50
nM
Kd
nM
EC50/IC50
nM
koff
s-1
kon
M-1s-1
pHTemp
°C
Cyclin B/Cyclin-Dependent Kinase 1 (CDK1)/G2/mitotic-specific cyclin B2/G2/mitotic-specific cyclin B3
(Homo sapiens (Human))
BDBM50132168
(CHEMBL103798 | Furan-2-ylmethyl-(9-isopropyl-9H-pu...)
Show SMILES CC(C)n1cnc2c(NCc3ccco3)ncnc12
Show InChI InChI=1S/C13H15N5O/c1-9(2)18-8-17-11-12(15-7-16-13(11)18)14-6-10-4-3-5-19-10/h3-5,7-9H,6H2,1-2H3,(H,14,15,16)
n/an/a>167n/an/an/an/an/an/a
Academy of Sciences of the Czech Republic
Curated by ChEMBL
Assay Description
In vitro antiproliferative activity against myeloid leukemia K562 cell line
Bioorg Med Chem Lett 13: 2989-92 (2003)
BindingDB Entry DOI: 10.7270/Q29Z948Q
Cyclin B/Cyclin-Dependent Kinase 1 (CDK1)/G2/mitotic-specific cyclin B2/G2/mitotic-specific cyclin B3
(Homo sapiens (Human))
BDBM50132168
(CHEMBL103798 | Furan-2-ylmethyl-(9-isopropyl-9H-pu...)
Show SMILES CC(C)n1cnc2c(NCc3ccco3)ncnc12
Show InChI InChI=1S/C13H15N5O/c1-9(2)18-8-17-11-12(15-7-16-13(11)18)14-6-10-4-3-5-19-10/h3-5,7-9H,6H2,1-2H3,(H,14,15,16)
n/an/a 9.10n/an/an/an/an/an/a
Academy of Sciences of the Czech Republic
Curated by ChEMBL
Assay Description
In vitro antiproliferative activity against myeloid leukemia K562 cell line
Bioorg Med Chem Lett 13: 2989-92 (2003)
BindingDB Entry DOI: 10.7270/Q29Z948Q