BDBM50132207 4-(6-Nitro-quinazolin-4-yl)-piperazine-1-carboxylic acid (4-phenoxy-phenyl)-amide::CHEMBL99635
SMILES: [O-][N+](=O)c1ccc2ncnc(N3CCN(CC3)C(=O)Nc3ccc(Oc4ccccc4)cc3)c2c1
InChI Key: InChIKey=CJDWXZXUHOXUIP-UHFFFAOYSA-N
Data: 1 IC50
Activity Spreadsheet -- Enzyme Inhibition Constant Data from BindingDB
Found 1 hit for monomerid = 50132207
Trg + Lig
Ki
nM
ΔG°
kcal/mole
IC50
nM
Kd
nM
EC50/IC50
nM
koff
s-1
kon
M-1s-1
pHTemp
°C
Platelet-derived growth factor receptor beta
(Homo sapiens (Human))
BDBM50132207
(4-(6-Nitro-quinazolin-4-yl)-piperazine-1-carboxyli...)
Show SMILES [O-][N+](=O)c1ccc2ncnc(N3CCN(CC3)C(=O)Nc3ccc(Oc4ccccc4)cc3)c2c1
Show InChI InChI=1S/C25H22N6O4/c32-25(28-18-6-9-21(10-7-18)35-20-4-2-1-3-5-20)30-14-12-29(13-15-30)24-22-16-19(31(33)34)8-11-23(22)26-17-27-24/h1-11,16-17H,12-15H2,(H,28,32)
NCI pathway
Reactome pathway
n/an/a 30n/an/an/an/an/an/a
Kyowa Hakko Kogyo Co., Ltd.
Curated by ChEMBL
Assay Description
Inhibitory concentration against platelet-derived growth factor receptor beta phosphorylation in CHO cells
Bioorg Med Chem Lett 13: 3001-4 (2003)
BindingDB Entry DOI: 10.7270/Q2668CKR