BDBM50132225 4-(7-Methoxy-quinazolin-4-yl)-piperazine-1-carboxylic acid (4-phenoxy-phenyl)-amide::CHEMBL103456
SMILES: COc1ccc2c(ncnc2c1)N1CCN(CC1)C(=O)Nc1ccc(Oc2ccccc2)cc1
InChI Key: InChIKey=RWLASTUQSDYAKT-UHFFFAOYSA-N
Data: 1 IC50
Activity Spreadsheet -- Enzyme Inhibition Constant Data from BindingDB
Found 1 hit for monomerid = 50132225
Trg + Lig
Ki
nM
ΔG°
kcal/mole
IC50
nM
Kd
nM
EC50/IC50
nM
koff
s-1
kon
M-1s-1
pHTemp
°C
Platelet-derived growth factor receptor beta
(Homo sapiens (Human))
BDBM50132225
(4-(7-Methoxy-quinazolin-4-yl)-piperazine-1-carboxy...)
Show SMILES COc1ccc2c(ncnc2c1)N1CCN(CC1)C(=O)Nc1ccc(Oc2ccccc2)cc1
Show InChI InChI=1S/C26H25N5O3/c1-33-22-11-12-23-24(17-22)27-18-28-25(23)30-13-15-31(16-14-30)26(32)29-19-7-9-21(10-8-19)34-20-5-3-2-4-6-20/h2-12,17-18H,13-16H2,1H3,(H,29,32)
NCI pathway
Reactome pathway
n/an/a 0.820n/an/an/an/an/an/a
Kyowa Hakko Kogyo Co., Ltd.
Curated by ChEMBL
Assay Description
Inhibitory concentration against platelet-derived growth factor receptor beta phosphorylation in CHO cells
Bioorg Med Chem Lett 13: 3001-4 (2003)
BindingDB Entry DOI: 10.7270/Q2668CKR