BDBM50132395 (6,7-Dimethoxy-quinoxalin-2-yl)-(3-methyl-cyclohexyl)-amine::CHEMBL107677
SMILES: COc1cc2ncc(NC3CCCC(C)C3)nc2cc1OC
InChI Key: InChIKey=BJFMFEYQCRMJSU-UHFFFAOYSA-N
Data: 2 IC50
Activity Spreadsheet -- Enzyme Inhibition Constant Data from BindingDB
Found 2 hits for monomerid = 50132395
Trg + Lig
Ki
nM
ΔG°
kcal/mole
IC50
nM
Kd
nM
EC50/IC50
nM
koff
s-1
kon
M-1s-1
pHTemp
°C
PDGFR-beta/Platelet-derived growth factor receptor alpha
(Homo sapiens (Human))
BDBM50132395
((6,7-Dimethoxy-quinoxalin-2-yl)-(3-methyl-cyclohex...)
Show SMILES COc1cc2ncc(NC3CCCC(C)C3)nc2cc1OC
Show InChI InChI=1S/C17H23N3O2/c1-11-5-4-6-12(7-11)19-17-10-18-13-8-15(21-2)16(22-3)9-14(13)20-17/h8-12H,4-7H2,1-3H3,(H,19,20)
Reactome pathway
n/an/a 41n/an/an/an/an/an/a
Aventis Pharmaceuticals
Curated by ChEMBL
Assay Description
Inhibition of Platelet-derived growth factor receptor
Bioorg Med Chem Lett 13: 3091-5 (2003)
BindingDB Entry DOI: 10.7270/Q2N8796B
PDGFR-beta/Platelet-derived growth factor receptor alpha
(Homo sapiens (Human))
BDBM50132395
((6,7-Dimethoxy-quinoxalin-2-yl)-(3-methyl-cyclohex...)
Show SMILES COc1cc2ncc(NC3CCCC(C)C3)nc2cc1OC
Show InChI InChI=1S/C17H23N3O2/c1-11-5-4-6-12(7-11)19-17-10-18-13-8-15(21-2)16(22-3)9-14(13)20-17/h8-12H,4-7H2,1-3H3,(H,19,20)
Reactome pathway
n/an/a 41n/an/an/an/an/an/a
Aventis Pharmaceuticals
Curated by ChEMBL
Assay Description
Inhibition of Platelet-derived growth factor receptor
Bioorg Med Chem Lett 13: 3097-100 (2003)
BindingDB Entry DOI: 10.7270/Q2HH6JGM