BDBM50132405 5-(6,7-Dimethoxy-quinoxalin-2-ylamino)-bicyclo[2.2.1]heptan-2-ol::CHEMBL105322
SMILES: COc1cc2ncc(N[C@@H]3CC4CC3C[C@H]4O)nc2cc1OC
InChI Key: InChIKey=FIQQIMWSRXTHTA-BXTUAPDASA-N
Data: 1 IC50
Activity Spreadsheet -- Enzyme Inhibition Constant Data from BindingDB
Found 1 hit for monomerid = 50132405
Trg + Lig
Ki
nM
ΔG°
kcal/mole
IC50
nM
Kd
nM
EC50/IC50
nM
koff
s-1
kon
M-1s-1
pHTemp
°C
PDGFR-beta/Platelet-derived growth factor receptor alpha
(Homo sapiens (Human))
BDBM50132405
(5-(6,7-Dimethoxy-quinoxalin-2-ylamino)-bicyclo[2.2...)
Show SMILES COc1cc2ncc(N[C@@H]3CC4CC3C[C@H]4O)nc2cc1OC |TLB:16:15:12:9.10,8:9:12:14.15|
Show InChI InChI=1S/C17H21N3O3/c1-22-15-6-12-13(7-16(15)23-2)20-17(8-18-12)19-11-4-10-3-9(11)5-14(10)21/h6-11,14,21H,3-5H2,1-2H3,(H,19,20)/t9?,10?,11-,14-/m1/s1
Reactome pathway
n/an/a 24n/an/an/an/an/an/a
Aventis Pharmaceuticals
Curated by ChEMBL
Assay Description
Inhibition of Platelet-derived growth factor receptor
Bioorg Med Chem Lett 13: 3097-100 (2003)
BindingDB Entry DOI: 10.7270/Q2HH6JGM