BDBM50132446 CHEMBL104583::tert-butyl 2-(5-methoxy-3-((2-oxo-5-sulfamoylindolin-3-ylidene)methyl)-1H-indol-1-yl)acetate::{5-Methoxy-3-[2-oxo-5-sulfamoyl-1,2-dihydro-indol-(3Z)-ylidenemethyl]-indol-1-yl}-acetic acid tert-butyl ester
SMILES: COc1ccc2n(CC(=O)OC(C)(C)C)cc(\C=C3/C(=O)Nc4ccc(cc34)S(N)(=O)=O)c2c1
InChI Key: InChIKey=ZULIXSWXDKXSOR-OCKHKDLRSA-N
Data: 2 IC50
Activity Spreadsheet -- Enzyme Inhibition Constant Data from BindingDB
Found 2 hits for monomerid = 50132446
Trg + Lig
Ki
nM
ΔG°
kcal/mole
IC50
nM
Kd
nM
EC50/IC50
nM
koff
s-1
kon
M-1s-1
pHTemp
°C
Tyrosine-protein kinase SYK
(Homo sapiens (Human))
BDBM50132446
(CHEMBL104583 | tert-butyl 2-(5-methoxy-3-((2-oxo-5...)
Show SMILES COc1ccc2n(CC(=O)OC(C)(C)C)cc(\C=C3/C(=O)Nc4ccc(cc34)S(N)(=O)=O)c2c1
Show InChI InChI=1S/C24H25N3O6S/c1-24(2,3)33-22(28)13-27-12-14(17-10-15(32-4)5-8-21(17)27)9-19-18-11-16(34(25,30)31)6-7-20(18)26-23(19)29/h5-12H,13H2,1-4H3,(H,26,29)(H2,25,30,31)/b19-9-
NCI pathway
Reactome pathway
n/an/a 1.00E+3n/an/an/an/an/an/a
Aventis Pharmaceuticals
Curated by ChEMBL
Assay Description
Inhibitory activity against human Syk protein tyrosine kinase expressed in yeast Klyveromyces lactis
Bioorg Med Chem Lett 13: 3111-4 (2003)
BindingDB Entry DOI: 10.7270/Q2ZG6SS7
Tyrosine-protein kinase SYK
(Homo sapiens (Human))
BDBM50132446
(CHEMBL104583 | tert-butyl 2-(5-methoxy-3-((2-oxo-5...)
Show SMILES COc1ccc2n(CC(=O)OC(C)(C)C)cc(\C=C3/C(=O)Nc4ccc(cc34)S(N)(=O)=O)c2c1
Show InChI InChI=1S/C24H25N3O6S/c1-24(2,3)33-22(28)13-27-12-14(17-10-15(32-4)5-8-21(17)27)9-19-18-11-16(34(25,30)31)6-7-20(18)26-23(19)29/h5-12H,13H2,1-4H3,(H,26,29)(H2,25,30,31)/b19-9-
NCI pathway
Reactome pathway
n/an/a 1.00E+3n/an/an/an/an/an/a
Sichuan University
Curated by ChEMBL
Assay Description
Inhibition of recombinant Syk (unknown origin)
Bioorg Med Chem Lett 19: 1944-9 (2009)
Article DOI: 10.1016/j.bmcl.2009.02.049
BindingDB Entry DOI: 10.7270/Q2WM1D98