BDBM50132716 CHEMBL113263::methyl dodecylphosphonofluoridoate
SMILES: CCCCCCCCCCCCP(F)(=O)OC
InChI Key: InChIKey=AUDRDSJPHLTEGD-UHFFFAOYSA-N
Data: 3 IC50
Activity Spreadsheet -- Enzyme Inhibition Constant Data from BindingDB
Found 3 hits for monomerid = 50132716
Trg + Lig
Ki
nM
ΔG°
kcal/mole
IC50
nM
Kd
nM
EC50/IC50
nM
koff
s-1
kon
M-1s-1
pHTemp
°C
Anandamide amidohydrolase
(Mus musculus (mouse))
BDBM50132716
(CHEMBL113263 | methyl dodecylphosphonofluoridoate)
Show SMILES CCCCCCCCCCCCP(F)(=O)OC
Show InChI InChI=1S/C13H28FO2P/c1-3-4-5-6-7-8-9-10-11-12-13-17(14,15)16-2/h3-13H2,1-2H3
n/an/a 2n/an/an/an/an/an/a
University of California
Curated by ChEMBL
Assay Description
Inhibitory potency of Fatty-acid amide hydrolase with Mouse brain memebrane
Bioorg Med Chem Lett 13: 3301-3 (2003)
BindingDB Entry DOI: 10.7270/Q2XK8DZD
Fatty-acid amide hydrolase 1
(Homo sapiens (Human))
BDBM50132716
(CHEMBL113263 | methyl dodecylphosphonofluoridoate)
Show SMILES CCCCCCCCCCCCP(F)(=O)OC
Show InChI InChI=1S/C13H28FO2P/c1-3-4-5-6-7-8-9-10-11-12-13-17(14,15)16-2/h3-13H2,1-2H3
n/an/a 3n/an/an/an/an/an/a
Universit£ Catholique de Louvain
Curated by ChEMBL
Assay Description
Irreversible inhibition of fatty acid amide hydrolase
J Med Chem 48: 5059-87 (2005)
Article DOI: 10.1021/jm058183t
BindingDB Entry DOI: 10.7270/Q2J96753
Fatty-acid amide hydrolase 1 (aa 30-579)
(Rattus norvegicus (rat))
BDBM50132716
(CHEMBL113263 | methyl dodecylphosphonofluoridoate)
Show SMILES CCCCCCCCCCCCP(F)(=O)OC
Show InChI InChI=1S/C13H28FO2P/c1-3-4-5-6-7-8-9-10-11-12-13-17(14,15)16-2/h3-13H2,1-2H3
n/an/a 3n/an/an/an/an/an/a
University of California
Curated by ChEMBL
Assay Description
Inhibitory potency of Fatty-acid amide hydrolase with rat brain memebrane
Bioorg Med Chem Lett 13: 3301-3 (2003)
BindingDB Entry DOI: 10.7270/Q2XK8DZD